SCl2..Cl anion
- Formula: Cl3S-
- Molecular weight: 138.425

Gas phase thermochemistry data

Data compiled by: John E. Bartmess
Quantity | Value | Units | Method | Reference | Comment |
---|---|---|---|---|---|
ΔfH°gas | -332.0 | kJ/mol | Ther | Gailbreath, Pommerening, et al., 2000 |

Reaction thermochemistry data

Data compiled by: John E. Bartmess
Individual Reactions
By formula: Cl- + Cl2S = Cl3S-
Quantity | Value | Units | Method | Reference | Comment |
---|---|---|---|---|---|
ΔrH° | 20.3 ± 1.9 | kcal/mol | CIDT | Gailbreath, Pommerening, et al., 2000 | gas phase |

Ion clustering data

Data compiled by: John E. Bartmess
Clustering reactions
By formula: Cl- + Cl2S = Cl3S-
Quantity | Value | Units | Method | Reference | Comment |
---|---|---|---|---|---|
ΔrH° | 20.3 ± 1.9 | kcal/mol | CIDT | Gailbreath, Pommerening, et al., 2000 | gas phase |

References

Gailbreath, Pommerening, et al., 2000
Gailbreath, B.D.; Pommerening, C.A.; Bachrach, S.M.; Sunderlin, L.S.,
Potential Energy Surface of SCl3-,
J. Phys. Chem., 2000, 104, 13, 2958, https://doi.org/10.1021/jp993671w
. [all data]