2,5-diCF3-phenide anion
- Formula: C8H3F6-
- Molecular weight: 213.1004

Gas phase ion energetics data

Data compiled by: John E. Bartmess
Protonation reactions
By formula: C8H3F6- + H+ = C8H4F6
Quantity | Value | Units | Method | Reference | Comment |
---|---|---|---|---|---|
ΔrH° | 375.2 ± 3.1 | kcal/mol | G+TS | Schlosser, Mongin, et al., 1998 | gas phase |
Quantity | Value | Units | Method | Reference | Comment |
ΔrG° | 366.6 ± 3.0 | kcal/mol | IMRE | Schlosser, Mongin, et al., 1998 | gas phase |

References

Schlosser, Mongin, et al., 1998
Schlosser, M.; Mongin, F.; Porwisiak, J.; Dmowski, W.; Buker, H.H.; Nibbering, N.M.M.,
Bis- and Oligo(trifluoromethyl)benzenes: Hydrogen/Metal Exchange Rates and Gas-Phase Acidities.,
Chem. Eur. J., 1998, 4, 7, 1281, https://doi.org/10.1002/(SICI)1521-3765(19980710)4:7<1281::AID-CHEM1281>3.0.CO;2-I
. [all data]