2,3,5,6-tetraCl-phenide anion

Reaction thermochemistry data

Data compiled by: John E. Bartmess

Individual Reactions

C6HCl4- + Hydrogen cation = Benzene, 1,2,4,5-tetrachloro-

By formula: C6HCl4- + H+ = C6H2Cl4

Quantity Value Units Method Reference Comment
Δr1514. ± 8.8kJ/molG+TSSchlosser, Marzi, et al., 2001gas phase; Acid: 1,2,4,5-tetrachlorobenzene.
Quantity Value Units Method Reference Comment
Δr1480. ± 8.4kJ/molIMRESchlosser, Marzi, et al., 2001gas phase; Acid: 1,2,4,5-tetrachlorobenzene.

Gas phase ion energetics data

Data compiled by: John E. Bartmess

Protonation reactions

C6HCl4- + Hydrogen cation = Benzene, 1,2,4,5-tetrachloro-

By formula: C6HCl4- + H+ = C6H2Cl4

Quantity Value Units Method Reference Comment
Δr361.8 ± 2.1kcal/molG+TSSchlosser, Marzi, et al., 2001gas phase; Acid: 1,2,4,5-tetrachlorobenzene.
Quantity Value Units Method Reference Comment
Δr353.7 ± 2.0kcal/molIMRESchlosser, Marzi, et al., 2001gas phase; Acid: 1,2,4,5-tetrachlorobenzene.

References

Schlosser, Marzi, et al., 2001
Schlosser, M.; Marzi, E.; Cottet, F.; Buker, H.H.; Nibbering, N.M.M., The acidity of chloro-substituted benzenes: A comparison of gas phase, ab initio, and kinetic data, Chem. Eur. J., 2001, 7, 16, 3511-3516, https://doi.org/10.1002/1521-3765(20010817)7:16<3511::AID-CHEM3511>3.0.CO;2-U . [all data]