Me2O..Cl anion
- Formula: C2H6ClO-
- Molecular weight: 81.522

Gas phase thermochemistry data

Data compiled by: John E. Bartmess
Quantity | Value | Units | Method | Reference | Comment |
---|---|---|---|---|---|
ΔfH°gas | -105.83 | kcal/mol | Ther | Bogdanov, Lee, et al., 2001 |

References

Bogdanov, Lee, et al., 2001
Bogdanov, B.; Lee, H.J.S.; McMahon, T.B.,
Influence of fluorine substitution on the structures and thermochemistry of chloride ion-ether complexes in the gas phase,
Int. J. Mass Spectrom., 2001, 210, 387-402, https://doi.org/10.1016/S1387-3806(01)00404-3
. [all data]