EtOO anion
- Formula: C2H5O2-
- Molecular weight: 61.0604

Reaction thermochemistry data

Data compiled by: John E. Bartmess
Individual Reactions
By formula: C2H5O2- + H+ = C2H6O2
Quantity | Value | Units | Method | Reference | Comment |
---|---|---|---|---|---|
ΔrH° | 370.9 ± 2.1 | kcal/mol | G+TS | Blanksby, Ramond, et al., 2001 | gas phase |
Quantity | Value | Units | Method | Reference | Comment |
ΔrG° | 363.9 ± 2.0 | kcal/mol | IMRE | Blanksby, Ramond, et al., 2001 | gas phase |

Gas phase ion energetics data

Data compiled by: John E. Bartmess
Electron affinity of neutral species
EAneutral (eV) | Method | Reference | Comment |
---|---|---|---|
1.1860 ± 0.0040 | LPES | Blanksby, Ramond, et al., 2001 |
Protonation reactions
By formula: C2H5O2- + H+ = C2H6O2
Quantity | Value | Units | Method | Reference | Comment |
---|---|---|---|---|---|
ΔrH° | 370.9 ± 2.1 | kcal/mol | G+TS | Blanksby, Ramond, et al., 2001 | gas phase |
Quantity | Value | Units | Method | Reference | Comment |
ΔrG° | 363.9 ± 2.0 | kcal/mol | IMRE | Blanksby, Ramond, et al., 2001 | gas phase |

References

Blanksby, Ramond, et al., 2001
Blanksby, S.J.; Ramond, T.M.; Davico, G.E.; Nimlos, M.R.; Kato, S.; Bierbaum, V.M.; Lineberger, W.C.; Ellison,
Negative-ion photoelectron spectroscopy, gas-phase acidity, and thermochemistry of the peroxyl radicals CH3OO and CH3CH2OO,
J. Am. Chem. Soc., 2001, 123, 39, 9585-9596, https://doi.org/10.1021/ja010942j
. [all data]