(CCl4)2..Cl anion
- Formula: C2Cl9-
- Molecular weight: 343.099

Reaction thermochemistry data

Data compiled by: John E. Bartmess
Individual Reactions
CCl5- + 2 = C2Cl9-
By formula: CCl5- + 2CCl4 = C2Cl9-
Quantity | Value | Units | Method | Reference | Comment |
---|---|---|---|---|---|
ΔrH° | 9.30 | kcal/mol | N/A | Hiraoka, Mizuno, et al., 2001 | gas phase |
Quantity | Value | Units | Method | Reference | Comment |
ΔrG° | 3.04 | kcal/mol | TDAs | Hiraoka, Mizuno, et al., 2001 | gas phase |

Ion clustering data

Data compiled by: John E. Bartmess
Clustering reactions
CCl5- + 2 = C2Cl9-
By formula: CCl5- + 2CCl4 = C2Cl9-
Quantity | Value | Units | Method | Reference | Comment |
---|---|---|---|---|---|
ΔrH° | 9.30 | kcal/mol | N/A | Hiraoka, Mizuno, et al., 2001 | gas phase |
Quantity | Value | Units | Method | Reference | Comment |
ΔrG° | 3.04 | kcal/mol | TDAs | Hiraoka, Mizuno, et al., 2001 | gas phase |

Gas phase thermochemistry data

Data compiled by: John E. Bartmess

Quantity Value Units Method Reference Comment
Δfgas-513.67kJ/molTherHiraoka, Mizuno, et al., 2001

References

Hiraoka, Mizuno, et al., 2001
Hiraoka, K.; Mizuno, T.; Iino, T.; Eguchi, D.; Yamabe, S.,
Characteristic changes of bond energies for gas-phase cluster ions of halide ions with methane and chloromethanes,
J. Phys. Chem. A, 2001, 105, 20, 4887-4893, https://doi.org/10.1021/jp010143n
. [all data]