(CH2Cl2)5..Cl anion
- Formula: C5H10Cl11-
- Molecular weight: 460.116

Reaction thermochemistry data

Data compiled by: John E. Bartmess
Individual Reactions
C4H8Cl9- + 5 = C5H10Cl11-
By formula: C4H8Cl9- + 5CH2Cl2 = C5H10Cl11-
Quantity | Value | Units | Method | Reference | Comment |
---|---|---|---|---|---|
ΔrH° | 7.70 | kcal/mol | N/A | Hiraoka, Mizuno, et al., 2001 | gas phase |
Quantity | Value | Units | Method | Reference | Comment |
ΔrG° | 2.63 | kcal/mol | TDAs | Hiraoka, Mizuno, et al., 2001 | gas phase |

Ion clustering data

Data compiled by: John E. Bartmess
Clustering reactions
C4H8Cl9- + 5 = C5H10Cl11-
By formula: C4H8Cl9- + 5CH2Cl2 = C5H10Cl11-
Quantity | Value | Units | Method | Reference | Comment |
---|---|---|---|---|---|
ΔrH° | 7.70 | kcal/mol | N/A | Hiraoka, Mizuno, et al., 2001 | gas phase |
Quantity | Value | Units | Method | Reference | Comment |
ΔrG° | 2.63 | kcal/mol | TDAs | Hiraoka, Mizuno, et al., 2001 | gas phase |

Gas phase thermochemistry data

Data compiled by: John E. Bartmess

Quantity Value Units Method Reference Comment
Δfgas-223.63kcal/molTherHiraoka, Mizuno, et al., 2001

References

Hiraoka, Mizuno, et al., 2001
Hiraoka, K.; Mizuno, T.; Iino, T.; Eguchi, D.; Yamabe, S.,
Characteristic changes of bond energies for gas-phase cluster ions of halide ions with methane and chloromethanes,
J. Phys. Chem. A, 2001, 105, 20, 4887-4893, https://doi.org/10.1021/jp010143n
. [all data]