(CH2Cl2)4..Cl anion

Gas phase thermochemistry data

Data compiled by: John E. Bartmess

Quantity Value Units Method Reference Comment
Δfgas-808.06kJ/molTherHiraoka, Mizuno, et al., 2001

Reaction thermochemistry data

Data compiled by: John E. Bartmess

Individual Reactions

C3H6Cl7- + 4Methylene chloride = C4H8Cl9-

By formula: C3H6Cl7- + 4CH2Cl2 = C4H8Cl9-

Quantity Value Units Method Reference Comment
Δr9.00kcal/molN/AHiraoka, Mizuno, et al., 2001gas phase
Quantity Value Units Method Reference Comment
Δr3.63kcal/molTDAsHiraoka, Mizuno, et al., 2001gas phase

C4H8Cl9- + 5Methylene chloride = C5H10Cl11-

By formula: C4H8Cl9- + 5CH2Cl2 = C5H10Cl11-

Quantity Value Units Method Reference Comment
Δr7.70kcal/molN/AHiraoka, Mizuno, et al., 2001gas phase
Quantity Value Units Method Reference Comment
Δr2.63kcal/molTDAsHiraoka, Mizuno, et al., 2001gas phase

Ion clustering data

Data compiled by: John E. Bartmess

Clustering reactions

C3H6Cl7- + 4Methylene chloride = C4H8Cl9-

By formula: C3H6Cl7- + 4CH2Cl2 = C4H8Cl9-

Quantity Value Units Method Reference Comment
Δr9.00kcal/molN/AHiraoka, Mizuno, et al., 2001gas phase
Quantity Value Units Method Reference Comment
Δr3.63kcal/molTDAsHiraoka, Mizuno, et al., 2001gas phase

C4H8Cl9- + 5Methylene chloride = C5H10Cl11-

By formula: C4H8Cl9- + 5CH2Cl2 = C5H10Cl11-

Quantity Value Units Method Reference Comment
Δr7.70kcal/molN/AHiraoka, Mizuno, et al., 2001gas phase
Quantity Value Units Method Reference Comment
Δr2.63kcal/molTDAsHiraoka, Mizuno, et al., 2001gas phase

References

Hiraoka, Mizuno, et al., 2001
Hiraoka, K.; Mizuno, T.; Iino, T.; Eguchi, D.; Yamabe, S., Characteristic changes of bond energies for gas-phase cluster ions of halide ions with methane and chloromethanes, J. Phys. Chem. A, 2001, 105, 20, 4887-4893, https://doi.org/10.1021/jp010143n . [all data]