(CH2Cl2)3..Cl anion
- Formula: C3H6Cl7-
- Molecular weight: 290.251

Reaction thermochemistry data

Data compiled by: John E. Bartmess
Individual Reactions
C2H4Cl5- + 3 = C3H6Cl7-
By formula: C2H4Cl5- + 3CH2Cl2 = C3H6Cl7-
Quantity | Value | Units | Method | Reference | Comment |
---|---|---|---|---|---|
ΔrH° | 40.6 | kJ/mol | N/A | Hiraoka, Mizuno, et al., 2001 | gas phase |
Quantity | Value | Units | Method | Reference | Comment |
ΔrG° | 19.4 | kJ/mol | TDAs | Hiraoka, Mizuno, et al., 2001 | gas phase |
C3H6Cl7- + 4 = C4H8Cl9-
By formula: C3H6Cl7- + 4CH2Cl2 = C4H8Cl9-
Quantity | Value | Units | Method | Reference | Comment |
---|---|---|---|---|---|
ΔrH° | 37.7 | kJ/mol | N/A | Hiraoka, Mizuno, et al., 2001 | gas phase |
Quantity | Value | Units | Method | Reference | Comment |
ΔrG° | 15.2 | kJ/mol | TDAs | Hiraoka, Mizuno, et al., 2001 | gas phase |

Ion clustering data

Data compiled by: John E. Bartmess
Clustering reactions
C2H4Cl5- + 3 = C3H6Cl7-
By formula: C2H4Cl5- + 3CH2Cl2 = C3H6Cl7-
Quantity | Value | Units | Method | Reference | Comment |
---|---|---|---|---|---|
ΔrH° | 40.6 | kJ/mol | N/A | Hiraoka, Mizuno, et al., 2001 | gas phase |
Quantity | Value | Units | Method | Reference | Comment |
ΔrG° | 19.4 | kJ/mol | TDAs | Hiraoka, Mizuno, et al., 2001 | gas phase |
C3H6Cl7- + 4 = C4H8Cl9-
By formula: C3H6Cl7- + 4CH2Cl2 = C4H8Cl9-
Quantity | Value | Units | Method | Reference | Comment |
---|---|---|---|---|---|
ΔrH° | 37.7 | kJ/mol | N/A | Hiraoka, Mizuno, et al., 2001 | gas phase |
Quantity | Value | Units | Method | Reference | Comment |
ΔrG° | 15.2 | kJ/mol | TDAs | Hiraoka, Mizuno, et al., 2001 | gas phase |

References

Hiraoka, Mizuno, et al., 2001
Hiraoka, K.; Mizuno, T.; Iino, T.; Eguchi, D.; Yamabe, S.,
Characteristic changes of bond energies for gas-phase cluster ions of halide ions with methane and chloromethanes,
J. Phys. Chem. A, 2001, 105, 20, 4887-4893, https://doi.org/10.1021/jp010143n
. [all data]