(CH2Cl2)2..Cl anion
- Formula: C2H4Cl5-
- Molecular weight: 205.319

Reaction thermochemistry data

Data compiled by: John E. Bartmess
Individual Reactions
CH2Cl3- + 2 = C2H4Cl5-
By formula: CH2Cl3- + 2CH2Cl2 = C2H4Cl5-
Quantity | Value | Units | Method | Reference | Comment |
---|---|---|---|---|---|
ΔrH° | 54.81 | kJ/mol | N/A | Hiraoka, Mizuno, et al., 2001 | gas phase |
Quantity | Value | Units | Method | Reference | Comment |
ΔrG° | 27.4 | kJ/mol | TDAs | Hiraoka, Mizuno, et al., 2001 | gas phase |
C2H4Cl5- + 3 = C3H6Cl7-
By formula: C2H4Cl5- + 3CH2Cl2 = C3H6Cl7-
Quantity | Value | Units | Method | Reference | Comment |
---|---|---|---|---|---|
ΔrH° | 40.6 | kJ/mol | N/A | Hiraoka, Mizuno, et al., 2001 | gas phase |
Quantity | Value | Units | Method | Reference | Comment |
ΔrG° | 19.4 | kJ/mol | TDAs | Hiraoka, Mizuno, et al., 2001 | gas phase |

Ion clustering data

Data compiled by: John E. Bartmess
Clustering reactions
CH2Cl3- + 2 = C2H4Cl5-
By formula: CH2Cl3- + 2CH2Cl2 = C2H4Cl5-
Quantity | Value | Units | Method | Reference | Comment |
---|---|---|---|---|---|
ΔrH° | 54.81 | kJ/mol | N/A | Hiraoka, Mizuno, et al., 2001 | gas phase |
Quantity | Value | Units | Method | Reference | Comment |
ΔrG° | 27.4 | kJ/mol | TDAs | Hiraoka, Mizuno, et al., 2001 | gas phase |
C2H4Cl5- + 3 = C3H6Cl7-
By formula: C2H4Cl5- + 3CH2Cl2 = C3H6Cl7-
Quantity | Value | Units | Method | Reference | Comment |
---|---|---|---|---|---|
ΔrH° | 40.6 | kJ/mol | N/A | Hiraoka, Mizuno, et al., 2001 | gas phase |
Quantity | Value | Units | Method | Reference | Comment |
ΔrG° | 19.4 | kJ/mol | TDAs | Hiraoka, Mizuno, et al., 2001 | gas phase |

Gas phase thermochemistry data

Data compiled by: John E. Bartmess

Quantity Value Units Method Reference Comment
Δfgas-128.83kcal/molTherHiraoka, Mizuno, et al., 2001

References

Hiraoka, Mizuno, et al., 2001
Hiraoka, K.; Mizuno, T.; Iino, T.; Eguchi, D.; Yamabe, S.,
Characteristic changes of bond energies for gas-phase cluster ions of halide ions with methane and chloromethanes,
J. Phys. Chem. A, 2001, 105, 20, 4887-4893, https://doi.org/10.1021/jp010143n
. [all data]