(MeCl)8..Cl anion
- Formula: C8H24Cl9-
- Molecular weight: 439.354

Gas phase thermochemistry data

Data compiled by: John E. Bartmess
Quantity | Value | Units | Method | Reference | Comment |
---|---|---|---|---|---|
ΔfH°gas | -1129.2 | kJ/mol | Ther | Hiraoka, Mizuno, et al., 2001 |

Ion clustering data

Data compiled by: John E. Bartmess
Clustering reactions
C7H21Cl8- + 8 = C8H24Cl9-
By formula: C7H21Cl8- + 8CH3Cl = C8H24Cl9-
Quantity | Value | Units | Method | Reference | Comment |
---|---|---|---|---|---|
ΔrH° | 19.7 | kJ/mol | N/A | Hiraoka, Mizuno, et al., 2001 | gas phase |
Quantity | Value | Units | Method | Reference | Comment |
ΔrG° | 2.2 | kJ/mol | TDAs | Hiraoka, Mizuno, et al., 2001 | gas phase |

Reaction thermochemistry data

Data compiled by: John E. Bartmess
Individual Reactions
C7H21Cl8- + 8 = C8H24Cl9-
By formula: C7H21Cl8- + 8CH3Cl = C8H24Cl9-
Quantity | Value | Units | Method | Reference | Comment |
---|---|---|---|---|---|
ΔrH° | 4.70 | kcal/mol | N/A | Hiraoka, Mizuno, et al., 2001 | gas phase |
Quantity | Value | Units | Method | Reference | Comment |
ΔrG° | 0.53 | kcal/mol | TDAs | Hiraoka, Mizuno, et al., 2001 | gas phase |

References

Hiraoka, Mizuno, et al., 2001
Hiraoka, K.; Mizuno, T.; Iino, T.; Eguchi, D.; Yamabe, S.,
Characteristic changes of bond energies for gas-phase cluster ions of halide ions with methane and chloromethanes,
J. Phys. Chem. A, 2001, 105, 20, 4887-4893, https://doi.org/10.1021/jp010143n
. [all data]