(MeCl)6..Cl anion
- Formula: C6H18Cl7-
- Molecular weight: 338.379

Reaction thermochemistry data

Data compiled by: John E. Bartmess
Individual Reactions
C5H15Cl6- + 6 = C6H18Cl7-
By formula: C5H15Cl6- + 6CH3Cl = C6H18Cl7-
Quantity | Value | Units | Method | Reference | Comment |
---|---|---|---|---|---|
ΔrH° | 24.3 | kJ/mol | N/A | Hiraoka, Mizuno, et al., 2001 | gas phase |
Quantity | Value | Units | Method | Reference | Comment |
ΔrG° | 1.8 | kJ/mol | TDAs | Hiraoka, Mizuno, et al., 2001 | gas phase |
C6H18Cl7- + 7 = C7H21Cl8-
By formula: C6H18Cl7- + 7CH3Cl = C7H21Cl8-
Quantity | Value | Units | Method | Reference | Comment |
---|---|---|---|---|---|
ΔrH° | 20.1 | kJ/mol | N/A | Hiraoka, Mizuno, et al., 2001 | gas phase |
Quantity | Value | Units | Method | Reference | Comment |
ΔrG° | 2.6 | kJ/mol | TDAs | Hiraoka, Mizuno, et al., 2001 | gas phase |

Ion clustering data

Data compiled by: John E. Bartmess
Clustering reactions
C5H15Cl6- + 6 = C6H18Cl7-
By formula: C5H15Cl6- + 6CH3Cl = C6H18Cl7-
Quantity | Value | Units | Method | Reference | Comment |
---|---|---|---|---|---|
ΔrH° | 24.3 | kJ/mol | N/A | Hiraoka, Mizuno, et al., 2001 | gas phase |
Quantity | Value | Units | Method | Reference | Comment |
ΔrG° | 1.8 | kJ/mol | TDAs | Hiraoka, Mizuno, et al., 2001 | gas phase |
C6H18Cl7- + 7 = C7H21Cl8-
By formula: C6H18Cl7- + 7CH3Cl = C7H21Cl8-
Quantity | Value | Units | Method | Reference | Comment |
---|---|---|---|---|---|
ΔrH° | 20.1 | kJ/mol | N/A | Hiraoka, Mizuno, et al., 2001 | gas phase |
Quantity | Value | Units | Method | Reference | Comment |
ΔrG° | 2.6 | kJ/mol | TDAs | Hiraoka, Mizuno, et al., 2001 | gas phase |

Gas phase thermochemistry data

Data compiled by: John E. Bartmess
Quantity | Value | Units | Method | Reference | Comment |
---|---|---|---|---|---|
ΔfH°gas | -925.71 | kJ/mol | Ther | Hiraoka, Mizuno, et al., 2001 |

References

Hiraoka, Mizuno, et al., 2001
Hiraoka, K.; Mizuno, T.; Iino, T.; Eguchi, D.; Yamabe, S.,
Characteristic changes of bond energies for gas-phase cluster ions of halide ions with methane and chloromethanes,
J. Phys. Chem. A, 2001, 105, 20, 4887-4893, https://doi.org/10.1021/jp010143n
. [all data]