(MeCl)5..Cl anion
- Formula: C5H15Cl6-
- Molecular weight: 287.891

Reaction thermochemistry data

Data compiled by: John E. Bartmess
Individual Reactions
C4H12Cl5- + 5 = C5H15Cl6-
By formula: C4H12Cl5- + 5CH3Cl = C5H15Cl6-
Quantity | Value | Units | Method | Reference | Comment |
---|---|---|---|---|---|
ΔrH° | 25.9 | kJ/mol | N/A | Hiraoka, Mizuno, et al., 2001 | gas phase |
Quantity | Value | Units | Method | Reference | Comment |
ΔrG° | 3.5 | kJ/mol | TDAs | Hiraoka, Mizuno, et al., 2001 | gas phase |
C5H15Cl6- + 6 = C6H18Cl7-
By formula: C5H15Cl6- + 6CH3Cl = C6H18Cl7-
Quantity | Value | Units | Method | Reference | Comment |
---|---|---|---|---|---|
ΔrH° | 24.3 | kJ/mol | N/A | Hiraoka, Mizuno, et al., 2001 | gas phase |
Quantity | Value | Units | Method | Reference | Comment |
ΔrG° | 1.8 | kJ/mol | TDAs | Hiraoka, Mizuno, et al., 2001 | gas phase |

Ion clustering data

Data compiled by: John E. Bartmess
Clustering reactions
C4H12Cl5- + 5 = C5H15Cl6-
By formula: C4H12Cl5- + 5CH3Cl = C5H15Cl6-
Quantity | Value | Units | Method | Reference | Comment |
---|---|---|---|---|---|
ΔrH° | 25.9 | kJ/mol | N/A | Hiraoka, Mizuno, et al., 2001 | gas phase |
Quantity | Value | Units | Method | Reference | Comment |
ΔrG° | 3.5 | kJ/mol | TDAs | Hiraoka, Mizuno, et al., 2001 | gas phase |
C5H15Cl6- + 6 = C6H18Cl7-
By formula: C5H15Cl6- + 6CH3Cl = C6H18Cl7-
Quantity | Value | Units | Method | Reference | Comment |
---|---|---|---|---|---|
ΔrH° | 24.3 | kJ/mol | N/A | Hiraoka, Mizuno, et al., 2001 | gas phase |
Quantity | Value | Units | Method | Reference | Comment |
ΔrG° | 1.8 | kJ/mol | TDAs | Hiraoka, Mizuno, et al., 2001 | gas phase |

Gas phase thermochemistry data

Data compiled by: John E. Bartmess

Quantity Value Units Method Reference Comment
Δfgas-819.56kJ/molTherHiraoka, Mizuno, et al., 2001

References

Hiraoka, Mizuno, et al., 2001
Hiraoka, K.; Mizuno, T.; Iino, T.; Eguchi, D.; Yamabe, S.,
Characteristic changes of bond energies for gas-phase cluster ions of halide ions with methane and chloromethanes,
J. Phys. Chem. A, 2001, 105, 20, 4887-4893, https://doi.org/10.1021/jp010143n
. [all data]