(MeCl)4..Cl anion
- Formula: C4H12Cl5-
- Molecular weight: 237.404

Gas phase thermochemistry data

Data compiled by: John E. Bartmess
Quantity | Value | Units | Method | Reference | Comment |
---|---|---|---|---|---|
ΔfH°gas | -711.74 | kJ/mol | Ther | Hiraoka, Mizuno, et al., 2001 |

Ion clustering data

Data compiled by: John E. Bartmess
Clustering reactions
C3H9Cl4- + 4 = C4H12Cl5-
By formula: C3H9Cl4- + 4CH3Cl = C4H12Cl5-
Quantity | Value | Units | Method | Reference | Comment |
---|---|---|---|---|---|
ΔrH° | 31.8 | kJ/mol | N/A | Hiraoka, Mizuno, et al., 2001 | gas phase |
Quantity | Value | Units | Method | Reference | Comment |
ΔrG° | 5.61 | kJ/mol | TDAs | Hiraoka, Mizuno, et al., 2001 | gas phase |
C4H12Cl5- + 5 = C5H15Cl6-
By formula: C4H12Cl5- + 5CH3Cl = C5H15Cl6-
Quantity | Value | Units | Method | Reference | Comment |
---|---|---|---|---|---|
ΔrH° | 25.9 | kJ/mol | N/A | Hiraoka, Mizuno, et al., 2001 | gas phase |
Quantity | Value | Units | Method | Reference | Comment |
ΔrG° | 3.5 | kJ/mol | TDAs | Hiraoka, Mizuno, et al., 2001 | gas phase |

Reaction thermochemistry data

Data compiled by: John E. Bartmess
Individual Reactions
C3H9Cl4- + 4 = C4H12Cl5-
By formula: C3H9Cl4- + 4CH3Cl = C4H12Cl5-
Quantity | Value | Units | Method | Reference | Comment |
---|---|---|---|---|---|
ΔrH° | 7.60 | kcal/mol | N/A | Hiraoka, Mizuno, et al., 2001 | gas phase |
Quantity | Value | Units | Method | Reference | Comment |
ΔrG° | 1.34 | kcal/mol | TDAs | Hiraoka, Mizuno, et al., 2001 | gas phase |
C4H12Cl5- + 5 = C5H15Cl6-
By formula: C4H12Cl5- + 5CH3Cl = C5H15Cl6-
Quantity | Value | Units | Method | Reference | Comment |
---|---|---|---|---|---|
ΔrH° | 6.20 | kcal/mol | N/A | Hiraoka, Mizuno, et al., 2001 | gas phase |
Quantity | Value | Units | Method | Reference | Comment |
ΔrG° | 0.83 | kcal/mol | TDAs | Hiraoka, Mizuno, et al., 2001 | gas phase |

References

Hiraoka, Mizuno, et al., 2001
Hiraoka, K.; Mizuno, T.; Iino, T.; Eguchi, D.; Yamabe, S.,
Characteristic changes of bond energies for gas-phase cluster ions of halide ions with methane and chloromethanes,
J. Phys. Chem. A, 2001, 105, 20, 4887-4893, https://doi.org/10.1021/jp010143n
. [all data]