(MeCl)2..Cl anion
- Formula: C2H6Cl3-
- Molecular weight: 136.429

Reaction thermochemistry data

Data compiled by: John E. Bartmess
Individual Reactions
CH3Cl2- + 2 = C2H6Cl3-
By formula: CH3Cl2- + 2CH3Cl = C2H6Cl3-
Quantity | Value | Units | Method | Reference | Comment |
---|---|---|---|---|---|
ΔrH° | 46.44 | kJ/mol | N/A | Hiraoka, Mizuno, et al., 2001 | gas phase |
Quantity | Value | Units | Method | Reference | Comment |
ΔrG° | 16.5 | kJ/mol | TDAs | Hiraoka, Mizuno, et al., 2001 | gas phase |
C2H6Cl3- + 3 = C3H9Cl4-
By formula: C2H6Cl3- + 3CH3Cl = C3H9Cl4-
Quantity | Value | Units | Method | Reference | Comment |
---|---|---|---|---|---|
ΔrH° | 35.1 | kJ/mol | N/A | Hiraoka, Mizuno, et al., 2001 | gas phase |
Quantity | Value | Units | Method | Reference | Comment |
ΔrG° | 8.95 | kJ/mol | TDAs | Hiraoka, Mizuno, et al., 2001 | gas phase |

Ion clustering data

Data compiled by: John E. Bartmess
Clustering reactions
CH3Cl2- + 2 = C2H6Cl3-
By formula: CH3Cl2- + 2CH3Cl = C2H6Cl3-
Quantity | Value | Units | Method | Reference | Comment |
---|---|---|---|---|---|
ΔrH° | 46.44 | kJ/mol | N/A | Hiraoka, Mizuno, et al., 2001 | gas phase |
Quantity | Value | Units | Method | Reference | Comment |
ΔrG° | 16.5 | kJ/mol | TDAs | Hiraoka, Mizuno, et al., 2001 | gas phase |
C2H6Cl3- + 3 = C3H9Cl4-
By formula: C2H6Cl3- + 3CH3Cl = C3H9Cl4-
Quantity | Value | Units | Method | Reference | Comment |
---|---|---|---|---|---|
ΔrH° | 35.1 | kJ/mol | N/A | Hiraoka, Mizuno, et al., 2001 | gas phase |
Quantity | Value | Units | Method | Reference | Comment |
ΔrG° | 8.95 | kJ/mol | TDAs | Hiraoka, Mizuno, et al., 2001 | gas phase |

Gas phase thermochemistry data

Data compiled by: John E. Bartmess
Quantity | Value | Units | Method | Reference | Comment |
---|---|---|---|---|---|
ΔfH°gas | -114.97 | kcal/mol | Ther | Hiraoka, Mizuno, et al., 2001 |

References

Hiraoka, Mizuno, et al., 2001
Hiraoka, K.; Mizuno, T.; Iino, T.; Eguchi, D.; Yamabe, S.,
Characteristic changes of bond energies for gas-phase cluster ions of halide ions with methane and chloromethanes,
J. Phys. Chem. A, 2001, 105, 20, 4887-4893, https://doi.org/10.1021/jp010143n
. [all data]