(CH4)2..Cl anion
- Formula: C2H8Cl-
- Molecular weight: 67.538

Reaction thermochemistry data

Data compiled by: John E. Bartmess
Individual Reactions
CH4Cl- + 2 = C2H8Cl-
By formula: CH4Cl- + 2CH4 = C2H8Cl-
Quantity | Value | Units | Method | Reference | Comment |
---|---|---|---|---|---|
ΔrH° | 14.6 | kJ/mol | N/A | Hiraoka, Mizuno, et al., 2001 | gas phase |
Quantity | Value | Units | Method | Reference | Comment |
ΔrG° | -12.8 | kJ/mol | TDAs | Hiraoka, Mizuno, et al., 2001 | gas phase |

Ion clustering data

Data compiled by: John E. Bartmess
Clustering reactions
CH4Cl- + 2 = C2H8Cl-
By formula: CH4Cl- + 2CH4 = C2H8Cl-
Quantity | Value | Units | Method | Reference | Comment |
---|---|---|---|---|---|
ΔrH° | 14.6 | kJ/mol | N/A | Hiraoka, Mizuno, et al., 2001 | gas phase |
Quantity | Value | Units | Method | Reference | Comment |
ΔrG° | -12.8 | kJ/mol | TDAs | Hiraoka, Mizuno, et al., 2001 | gas phase |

Gas phase thermochemistry data

Data compiled by: John E. Bartmess
Quantity | Value | Units | Method | Reference | Comment |
---|---|---|---|---|---|
ΔfH°gas | -406.9 | kJ/mol | Ther | Hiraoka, Mizuno, et al., 2001 |

References

Hiraoka, Mizuno, et al., 2001
Hiraoka, K.; Mizuno, T.; Iino, T.; Eguchi, D.; Yamabe, S.,
Characteristic changes of bond energies for gas-phase cluster ions of halide ions with methane and chloromethanes,
J. Phys. Chem. A, 2001, 105, 20, 4887-4893, https://doi.org/10.1021/jp010143n
. [all data]