(CH4)10..F anion
- Formula: C10H40F-
- Molecular weight: 179.4236

Gas phase thermochemistry data

Data compiled by: John E. Bartmess
Quantity | Value | Units | Method | Reference | Comment |
---|---|---|---|---|---|
ΔfH°gas | -1170.1 | kJ/mol | Ther | Hiraoka, Mizuno, et al., 2001 |

Ion clustering data

Data compiled by: John E. Bartmess
Clustering reactions
C9H36F- + 10 = C10H40F-
By formula: C9H36F- + 10CH4 = C10H40F-
Quantity | Value | Units | Method | Reference | Comment |
---|---|---|---|---|---|
ΔrH° | 7.53 | kJ/mol | N/A | Hiraoka, Mizuno, et al., 2001 | gas phase |
Quantity | Value | Units | Method | Reference | Comment |
ΔrG° | -17.4 | kJ/mol | TDAs | Hiraoka, Mizuno, et al., 2001 | gas phase |

References

Hiraoka, Mizuno, et al., 2001
Hiraoka, K.; Mizuno, T.; Iino, T.; Eguchi, D.; Yamabe, S.,
Characteristic changes of bond energies for gas-phase cluster ions of halide ions with methane and chloromethanes,
J. Phys. Chem. A, 2001, 105, 20, 4887-4893, https://doi.org/10.1021/jp010143n
. [all data]