(CH4)9..F anion
- Formula: C9H36F-
- Molecular weight: 163.3811

Gas phase thermochemistry data

Data compiled by: John E. Bartmess
Quantity | Value | Units | Method | Reference | Comment |
---|---|---|---|---|---|
ΔfH°gas | -260.06 | kcal/mol | Ther | Hiraoka, Mizuno, et al., 2001 |

Ion clustering data

Data compiled by: John E. Bartmess
Clustering reactions
C8H32F- + 9 = C9H36F-
By formula: C8H32F- + 9CH4 = C9H36F-
Quantity | Value | Units | Method | Reference | Comment |
---|---|---|---|---|---|
ΔrH° | 2.30 | kcal/mol | N/A | Hiraoka, Mizuno, et al., 2001 | gas phase |
Quantity | Value | Units | Method | Reference | Comment |
ΔrG° | -3.96 | kcal/mol | TDAs | Hiraoka, Mizuno, et al., 2001 | gas phase |
C9H36F- + 10 = C10H40F-
By formula: C9H36F- + 10CH4 = C10H40F-
Quantity | Value | Units | Method | Reference | Comment |
---|---|---|---|---|---|
ΔrH° | 1.80 | kcal/mol | N/A | Hiraoka, Mizuno, et al., 2001 | gas phase |
Quantity | Value | Units | Method | Reference | Comment |
ΔrG° | -4.16 | kcal/mol | TDAs | Hiraoka, Mizuno, et al., 2001 | gas phase |

Reaction thermochemistry data

Data compiled by: John E. Bartmess

Individual Reactions

C9H36F- + 10Methane = C10H40F-

By formula: C9H36F- + 10CH4 = C10H40F-

Quantity Value Units Method Reference Comment
Δr7.53kJ/molN/AHiraoka, Mizuno, et al., 2001gas phase
Quantity Value Units Method Reference Comment
Δr-17.4kJ/molTDAsHiraoka, Mizuno, et al., 2001gas phase

C8H32F- + 9Methane = C9H36F-

By formula: C8H32F- + 9CH4 = C9H36F-

Quantity Value Units Method Reference Comment
Δr9.62kJ/molN/AHiraoka, Mizuno, et al., 2001gas phase
Quantity Value Units Method Reference Comment
Δr-16.6kJ/molTDAsHiraoka, Mizuno, et al., 2001gas phase

References

Hiraoka, Mizuno, et al., 2001
Hiraoka, K.; Mizuno, T.; Iino, T.; Eguchi, D.; Yamabe, S.,
Characteristic changes of bond energies for gas-phase cluster ions of halide ions with methane and chloromethanes,
J. Phys. Chem. A, 2001, 105, 20, 4887-4893, https://doi.org/10.1021/jp010143n
. [all data]