(CH4)7..F anion
- Formula: C7H28F-
- Molecular weight: 131.2962

Gas phase thermochemistry data

Data compiled by: John E. Bartmess
Quantity | Value | Units | Method | Reference | Comment |
---|---|---|---|---|---|
ΔfH°gas | -917.30 | kJ/mol | Ther | Hiraoka, Mizuno, et al., 2001 |

Ion clustering data

Data compiled by: John E. Bartmess
Clustering reactions
C6H24F- + 7 = C7H28F-
By formula: C6H24F- + 7CH4 = C7H28F-
Quantity | Value | Units | Method | Reference | Comment |
---|---|---|---|---|---|
ΔrH° | 13.8 | kJ/mol | N/A | Hiraoka, Mizuno, et al., 2001 | gas phase |
Quantity | Value | Units | Method | Reference | Comment |
ΔrG° | -12.4 | kJ/mol | TDAs | Hiraoka, Mizuno, et al., 2001 | gas phase |
C7H28F- + 8 = C8H32F-
By formula: C7H28F- + 8CH4 = C8H32F-
Quantity | Value | Units | Method | Reference | Comment |
---|---|---|---|---|---|
ΔrH° | 12.1 | kJ/mol | N/A | Hiraoka, Mizuno, et al., 2001 | gas phase |
Quantity | Value | Units | Method | Reference | Comment |
ΔrG° | -15.3 | kJ/mol | TDAs | Hiraoka, Mizuno, et al., 2001 | gas phase |

Reaction thermochemistry data

Data compiled by: John E. Bartmess

Individual Reactions

C6H24F- + 7Methane = C7H28F-

By formula: C6H24F- + 7CH4 = C7H28F-

Quantity Value Units Method Reference Comment
Δr13.8kJ/molN/AHiraoka, Mizuno, et al., 2001gas phase
Quantity Value Units Method Reference Comment
Δr-12.4kJ/molTDAsHiraoka, Mizuno, et al., 2001gas phase

C7H28F- + 8Methane = C8H32F-

By formula: C7H28F- + 8CH4 = C8H32F-

Quantity Value Units Method Reference Comment
Δr12.1kJ/molN/AHiraoka, Mizuno, et al., 2001gas phase
Quantity Value Units Method Reference Comment
Δr-15.3kJ/molTDAsHiraoka, Mizuno, et al., 2001gas phase

References

Hiraoka, Mizuno, et al., 2001
Hiraoka, K.; Mizuno, T.; Iino, T.; Eguchi, D.; Yamabe, S.,
Characteristic changes of bond energies for gas-phase cluster ions of halide ions with methane and chloromethanes,
J. Phys. Chem. A, 2001, 105, 20, 4887-4893, https://doi.org/10.1021/jp010143n
. [all data]