(CH4)6..F anion
- Formula: C6H24F-
- Molecular weight: 115.2537

Reaction thermochemistry data

Data compiled by: John E. Bartmess
Individual Reactions
C5H20F- + 6 = C6H24F-
By formula: C5H20F- + 6CH4 = C6H24F-
Quantity | Value | Units | Method | Reference | Comment |
---|---|---|---|---|---|
ΔrH° | 17.6 | kJ/mol | N/A | Hiraoka, Mizuno, et al., 2001 | gas phase |
Quantity | Value | Units | Method | Reference | Comment |
ΔrG° | -13.6 | kJ/mol | TDAs | Hiraoka, Mizuno, et al., 2001 | gas phase |
C6H24F- + 7 = C7H28F-
By formula: C6H24F- + 7CH4 = C7H28F-
Quantity | Value | Units | Method | Reference | Comment |
---|---|---|---|---|---|
ΔrH° | 13.8 | kJ/mol | N/A | Hiraoka, Mizuno, et al., 2001 | gas phase |
Quantity | Value | Units | Method | Reference | Comment |
ΔrG° | -12.4 | kJ/mol | TDAs | Hiraoka, Mizuno, et al., 2001 | gas phase |

Ion clustering data

Data compiled by: John E. Bartmess
Clustering reactions
C5H20F- + 6 = C6H24F-
By formula: C5H20F- + 6CH4 = C6H24F-
Quantity | Value | Units | Method | Reference | Comment |
---|---|---|---|---|---|
ΔrH° | 17.6 | kJ/mol | N/A | Hiraoka, Mizuno, et al., 2001 | gas phase |
Quantity | Value | Units | Method | Reference | Comment |
ΔrG° | -13.6 | kJ/mol | TDAs | Hiraoka, Mizuno, et al., 2001 | gas phase |
C6H24F- + 7 = C7H28F-
By formula: C6H24F- + 7CH4 = C7H28F-
Quantity | Value | Units | Method | Reference | Comment |
---|---|---|---|---|---|
ΔrH° | 13.8 | kJ/mol | N/A | Hiraoka, Mizuno, et al., 2001 | gas phase |
Quantity | Value | Units | Method | Reference | Comment |
ΔrG° | -12.4 | kJ/mol | TDAs | Hiraoka, Mizuno, et al., 2001 | gas phase |

Gas phase thermochemistry data

Data compiled by: John E. Bartmess

Quantity Value Units Method Reference Comment
Δfgas-828.98kJ/molTherHiraoka, Mizuno, et al., 2001

References

Hiraoka, Mizuno, et al., 2001
Hiraoka, K.; Mizuno, T.; Iino, T.; Eguchi, D.; Yamabe, S.,
Characteristic changes of bond energies for gas-phase cluster ions of halide ions with methane and chloromethanes,
J. Phys. Chem. A, 2001, 105, 20, 4887-4893, https://doi.org/10.1021/jp010143n
. [all data]