(CH4)5..F anion
- Formula: C5H20F-
- Molecular weight: 99.2113

Gas phase thermochemistry data

Data compiled by: John E. Bartmess
Quantity | Value | Units | Method | Reference | Comment |
---|---|---|---|---|---|
ΔfH°gas | -176.12 | kcal/mol | Ther | Hiraoka, Mizuno, et al., 2001 |

Reaction thermochemistry data

Data compiled by: John E. Bartmess
Individual Reactions
C4H16F- + 5 = C5H20F-
By formula: C4H16F- + 5CH4 = C5H20F-
Quantity | Value | Units | Method | Reference | Comment |
---|---|---|---|---|---|
ΔrH° | 4.50 | kcal/mol | N/A | Hiraoka, Mizuno, et al., 2001 | gas phase |
Quantity | Value | Units | Method | Reference | Comment |
ΔrG° | -2.95 | kcal/mol | TDAs | Hiraoka, Mizuno, et al., 2001 | gas phase |
C5H20F- + 6 = C6H24F-
By formula: C5H20F- + 6CH4 = C6H24F-
Quantity | Value | Units | Method | Reference | Comment |
---|---|---|---|---|---|
ΔrH° | 4.20 | kcal/mol | N/A | Hiraoka, Mizuno, et al., 2001 | gas phase |
Quantity | Value | Units | Method | Reference | Comment |
ΔrG° | -3.25 | kcal/mol | TDAs | Hiraoka, Mizuno, et al., 2001 | gas phase |

References

Hiraoka, Mizuno, et al., 2001
Hiraoka, K.; Mizuno, T.; Iino, T.; Eguchi, D.; Yamabe, S.,
Characteristic changes of bond energies for gas-phase cluster ions of halide ions with methane and chloromethanes,
J. Phys. Chem. A, 2001, 105, 20, 4887-4893, https://doi.org/10.1021/jp010143n
. [all data]