(CH4)3..F anion
- Formula: C3H12F-
- Molecular weight: 67.1263

Ion clustering data

Data compiled by: John E. Bartmess
Clustering reactions
C2H8F- + 3 = C3H12F-
By formula: C2H8F- + 3CH4 = C3H12F-
Quantity | Value | Units | Method | Reference | Comment |
---|---|---|---|---|---|
ΔrH° | 23.0 | kJ/mol | N/A | Hiraoka, Mizuno, et al., 2001 | gas phase |
Quantity | Value | Units | Method | Reference | Comment |
ΔrG° | -5.69 | kJ/mol | TDAs | Hiraoka, Mizuno, et al., 2001 | gas phase |
C3H12F- + 4 = C4H16F-
By formula: C3H12F- + 4CH4 = C4H16F-
Quantity | Value | Units | Method | Reference | Comment |
---|---|---|---|---|---|
ΔrH° | 20.9 | kJ/mol | N/A | Hiraoka, Mizuno, et al., 2001 | gas phase |
Quantity | Value | Units | Method | Reference | Comment |
ΔrG° | -9.04 | kJ/mol | TDAs | Hiraoka, Mizuno, et al., 2001 | gas phase |

Gas phase thermochemistry data

Data compiled by: John E. Bartmess

Quantity Value Units Method Reference Comment
Δfgas-131.00kcal/molTherHiraoka, Mizuno, et al., 2001

Reaction thermochemistry data

Data compiled by: John E. Bartmess

Individual Reactions

C2H8F- + 3Methane = C3H12F-

By formula: C2H8F- + 3CH4 = C3H12F-

Quantity Value Units Method Reference Comment
Δr5.50kcal/molN/AHiraoka, Mizuno, et al., 2001gas phase
Quantity Value Units Method Reference Comment
Δr-1.36kcal/molTDAsHiraoka, Mizuno, et al., 2001gas phase

C3H12F- + 4Methane = C4H16F-

By formula: C3H12F- + 4CH4 = C4H16F-

Quantity Value Units Method Reference Comment
Δr5.00kcal/molN/AHiraoka, Mizuno, et al., 2001gas phase
Quantity Value Units Method Reference Comment
Δr-2.16kcal/molTDAsHiraoka, Mizuno, et al., 2001gas phase

References

Hiraoka, Mizuno, et al., 2001
Hiraoka, K.; Mizuno, T.; Iino, T.; Eguchi, D.; Yamabe, S.,
Characteristic changes of bond energies for gas-phase cluster ions of halide ions with methane and chloromethanes,
J. Phys. Chem. A, 2001, 105, 20, 4887-4893, https://doi.org/10.1021/jp010143n
. [all data]