CH4..F anion
- Formula: CH4F-
- Molecular weight: 35.0414

Reaction thermochemistry data

Data compiled by: John E. Bartmess
Individual Reactions
Quantity | Value | Units | Method | Reference | Comment |
---|---|---|---|---|---|
ΔrH° | 28.0 | kJ/mol | N/A | Hiraoka, Mizuno, et al., 2001 | gas phase |
Quantity | Value | Units | Method | Reference | Comment |
ΔrG° | 6.82 | kJ/mol | TDAs | Hiraoka, Mizuno, et al., 2001 | gas phase |
CH4F- + 2 = C2H8F-
By formula: CH4F- + 2CH4 = C2H8F-
Quantity | Value | Units | Method | Reference | Comment |
---|---|---|---|---|---|
ΔrH° | 24.7 | kJ/mol | N/A | Hiraoka, Mizuno, et al., 2001 | gas phase |
Quantity | Value | Units | Method | Reference | Comment |
ΔrG° | -1.5 | kJ/mol | TDAs | Hiraoka, Mizuno, et al., 2001 | gas phase |

Ion clustering data

Data compiled by: John E. Bartmess
Clustering reactions
CH4F- + 2 = C2H8F-
By formula: CH4F- + 2CH4 = C2H8F-
Quantity | Value | Units | Method | Reference | Comment |
---|---|---|---|---|---|
ΔrH° | 24.7 | kJ/mol | N/A | Hiraoka, Mizuno, et al., 2001 | gas phase |
Quantity | Value | Units | Method | Reference | Comment |
ΔrG° | -1.5 | kJ/mol | TDAs | Hiraoka, Mizuno, et al., 2001 | gas phase |
Quantity | Value | Units | Method | Reference | Comment |
---|---|---|---|---|---|
ΔrH° | 28.0 | kJ/mol | N/A | Hiraoka, Mizuno, et al., 2001 | gas phase |
Quantity | Value | Units | Method | Reference | Comment |
ΔrG° | 6.82 | kJ/mol | TDAs | Hiraoka, Mizuno, et al., 2001 | gas phase |

Gas phase thermochemistry data

Data compiled by: John E. Bartmess
Quantity | Value | Units | Method | Reference | Comment |
---|---|---|---|---|---|
ΔfH°gas | -351.4 | kJ/mol | Ther | Hiraoka, Mizuno, et al., 2001 |

References

Hiraoka, Mizuno, et al., 2001
Hiraoka, K.; Mizuno, T.; Iino, T.; Eguchi, D.; Yamabe, S.,
Characteristic changes of bond energies for gas-phase cluster ions of halide ions with methane and chloromethanes,
J. Phys. Chem. A, 2001, 105, 20, 4887-4893, https://doi.org/10.1021/jp010143n
. [all data]