CH4..I anion
- Formula: CH4I-
- Molecular weight: 142.9475

Gas phase thermochemistry data

Data compiled by: John E. Bartmess
Quantity | Value | Units | Method | Reference | Comment |
---|---|---|---|---|---|
ΔfH°gas | -65.43 | kcal/mol | Ther | Hiraoka, Mizuno, et al., 2001 |

Ion clustering data

Data compiled by: John E. Bartmess
Clustering reactions
Quantity | Value | Units | Method | Reference | Comment |
---|---|---|---|---|---|
ΔrH° | 2.60 | kcal/mol | N/A | Hiraoka, Mizuno, et al., 2001 | gas phase |
Quantity | Value | Units | Method | Reference | Comment |
ΔrG° | -2.77 | kcal/mol | TDAs | Hiraoka, Mizuno, et al., 2001 | gas phase |

Reaction thermochemistry data

Data compiled by: John E. Bartmess

Individual Reactions

Iodide + Methane = CH4I-

By formula: I- + CH4 = CH4I-

Quantity Value Units Method Reference Comment
Δr10.9kJ/molN/AHiraoka, Mizuno, et al., 2001gas phase
Quantity Value Units Method Reference Comment
Δr-11.6kJ/molTDAsHiraoka, Mizuno, et al., 2001gas phase

References

Hiraoka, Mizuno, et al., 2001
Hiraoka, K.; Mizuno, T.; Iino, T.; Eguchi, D.; Yamabe, S.,
Characteristic changes of bond energies for gas-phase cluster ions of halide ions with methane and chloromethanes,
J. Phys. Chem. A, 2001, 105, 20, 4887-4893, https://doi.org/10.1021/jp010143n
. [all data]