PhSiMe2 anion
- Formula: C8H11Si-
- Molecular weight: 135.2590

Reaction thermochemistry data

Data compiled by: John E. Bartmess
Individual Reactions
By formula: C8H11Si- + H+ = C8H12Si
Quantity | Value | Units | Method | Reference | Comment |
---|---|---|---|---|---|
ΔrH° | 1582. ± 9.2 | kJ/mol | G+TS | Irie, Kikukawa, et al., 2001 | gas phase; The anion may be ArSiH(Me)CH2-, based on LFER size and ab initio calculations - JEB |
Quantity | Value | Units | Method | Reference | Comment |
ΔrG° | 1550. ± 8.4 | kJ/mol | IMRE | Irie, Kikukawa, et al., 2001 | gas phase; The anion may be ArSiH(Me)CH2-, based on LFER size and ab initio calculations - JEB |

Gas phase ion energetics data

Data compiled by: John E. Bartmess
Protonation reactions
By formula: C8H11Si- + H+ = C8H12Si
Quantity | Value | Units | Method | Reference | Comment |
---|---|---|---|---|---|
ΔrH° | 1582. ± 9.2 | kJ/mol | G+TS | Irie, Kikukawa, et al., 2001 | gas phase; The anion may be ArSiH(Me)CH2-, based on LFER size and ab initio calculations - JEB |
Quantity | Value | Units | Method | Reference | Comment |
ΔrG° | 1550. ± 8.4 | kJ/mol | IMRE | Irie, Kikukawa, et al., 2001 | gas phase; The anion may be ArSiH(Me)CH2-, based on LFER size and ab initio calculations - JEB |

References

Irie, Kikukawa, et al., 2001
Irie, M.; Kikukawa, K.; Shimizu, N.; Mishima, M.,
Gas-phase acidities of aryldimethylsilanes,
J. Chem. Soc. Perkin Trans., 2001, 2, 6, 923-928, https://doi.org/10.1039/b100488n
. [all data]