lutetium anion

Gas phase thermochemistry data

Data compiled by: John E. Bartmess

Quantity Value Units Method Reference Comment
Δfgas394.8 ± 2.3kJ/molR-EADavis and Thompson, 2001

References

Davis and Thompson, 2001
Davis, V.T.; Thompson, J.S., Measurement of the electron affinity of lutetium, J. Phys. B: Atom. Mol. Opt. Phys., 2001, 34, 14, L433-L437, https://doi.org/10.1088/0953-4075/34/14/102 . [all data]