Y8O2 radical anion

Gas phase ion energetics data

Data compiled by: John E. Bartmess

Electron affinity of neutral species

EAneutral (eV) Method Reference Comment
1.34 ± 0.30LPESPramann, Nakamura, et al., 2001Vertical Detachment Energy: 1.73±0.16 eV

References

Pramann, Nakamura, et al., 2001
Pramann, A.; Nakamura, Y.; Nakajima, A.; Kaya, K., Photoelectron spectroscopy of yttrium oxide cluster anions: Effects of oxygen and metal atom addition, J. Phys. Chem. A, 2001, 105, 32, 7534-7540, https://doi.org/10.1021/jp010749b . [all data]