CD3CD2O anion

Reaction thermochemistry data

Data compiled by: John E. Bartmess

Individual Reactions

C2D5O- + Deuterium cation = [2H6]ethanol

By formula: C2D5O- + D+ = C2D6O

Quantity Value Units Method Reference Comment
Δr1583.7 ± 0.92kJ/molD-EARamond, Davico, et al., 2000gas phase
Δr1584. ± 8.8kJ/molG+TSDang, Motell, et al., 1993gas phase
Δr1584. ± 8.4kJ/molCIDCHaas and Harrison, 1993gas phase; Both metastable and 50 eV collision energy.
Quantity Value Units Method Reference Comment
Δr1553.7 ± 2.7kJ/molH-TSRamond, Davico, et al., 2000gas phase
Δr1554. ± 8.4kJ/molIMREDang, Motell, et al., 1993gas phase
Δr1554. ± 8.8kJ/molH-TSHaas and Harrison, 1993gas phase; Both metastable and 50 eV collision energy.

Gas phase ion energetics data

Data compiled by: John E. Bartmess

Electron affinity of neutral species

EAneutral (eV) Method Reference Comment
1.6990 ± 0.0040LPESRamond, Davico, et al., 2000
1.7030 ± 0.0070LPESDang, Motell, et al., 1993
1.702 ± 0.033LPESEllison, Engleking, et al., 1982

References

Ramond, Davico, et al., 2000
Ramond, T.M.; Davico, G.E.; Schwartz, R.L.; Lineberger, W.C., Vibronic structure of alkoxy radicals via photoelectron spectroscopy, J. Chem. Phys., 2000, 112, 3, 1158-1169, https://doi.org/10.1063/1.480767 . [all data]

Dang, Motell, et al., 1993
Dang, T.T.; Motell, E.L.; Travers, M.J.; Clifford, E.P.; Ellison, G.B.; Depuy, C.H.; Bierbaum, V.M., Experimental and Computational Studies of Deuterated Ethanols - Gas-Phase Acidities, Electron Affinities and Bond Dissociation Energies, Int. J. Mass Spectrom. Ion Proc., 1993, 123, 3, 171, https://doi.org/10.1016/0168-1176(93)87096-B . [all data]

Haas and Harrison, 1993
Haas, M.J.; Harrison, A.G., The Fragmentation of Proton-Bound Cluster Ions and the Gas-Phase Acidities of Alcohols, Int. J. Mass Spectrom. Ion Proc., 1993, 124, 2, 115, https://doi.org/10.1016/0168-1176(93)80003-W . [all data]

Ellison, Engleking, et al., 1982
Ellison, G.B.; Engleking, P.C.; Lineberger, W.C., Photoelectron spectroscopy of alkoxide and enolate negative ions, J. Phys. Chem., 1982, 86, 4873. [all data]