CO2..(pyridine)4 radical anion

Gas phase ion energetics data

Data compiled by: John E. Bartmess

Electron affinity of neutral species

EAneutral (eV) Method Reference Comment
2.23LPESHan, Chu, et al., 2000Stated electron affinity is the Vertical Detachment Energy

References

Han, Chu, et al., 2000
Han, S.Y.; Chu, I.; Kim, J.H.; Song, J.K.; Kim, S.K., Photoelectron spectroscopy and ab initio study of mixed cluster anions of [(CO2)(1-3)(Pyridine)(1-6)](-): Formation of a covalently bonded anion core of (C5H5N-CO2)(-), J. Chem. Phys., 2000, 113, 2, 596-601, https://doi.org/10.1063/1.481913 . [all data]