SiF4..SiF5 anion
- Formula: F9Si2-
- Molecular weight: 227.1572

Gas phase thermochemistry data

Data compiled by: John E. Bartmess
Quantity | Value | Units | Method | Reference | Comment |
---|---|---|---|---|---|
ΔfH°gas | -870.8 ± 2.2 | kcal/mol | Ther | Hiraoka, Nasu, et al., 2000 |

Reaction thermochemistry data

Data compiled by: John E. Bartmess
Individual Reactions
F5Si- + = F9Si2-
By formula: F5Si- + F4Si = F9Si2-
Quantity | Value | Units | Method | Reference | Comment |
---|---|---|---|---|---|
ΔrH° | 9.6 ± 2.0 | kcal/mol | IMRE | Hiraoka, Nasu, et al., 2000 | gas phase |
Quantity | Value | Units | Method | Reference | Comment |
ΔrG° | 5.13 | kcal/mol | IMRE | Hiraoka, Nasu, et al., 2000 | gas phase |

Ion clustering data

Data compiled by: John E. Bartmess
Clustering reactions
F5Si- + = F9Si2-
By formula: F5Si- + F4Si = F9Si2-
Quantity | Value | Units | Method | Reference | Comment |
---|---|---|---|---|---|
ΔrH° | 9.6 ± 2.0 | kcal/mol | IMRE | Hiraoka, Nasu, et al., 2000 | gas phase |
Quantity | Value | Units | Method | Reference | Comment |
ΔrG° | 5.13 | kcal/mol | IMRE | Hiraoka, Nasu, et al., 2000 | gas phase |

References

Hiraoka, Nasu, et al., 2000
Hiraoka, K.; Nasu, M.; Minamitsu, A.; Shimizu, A.; Yamabe, S.,
On the structure and stability of gas-phase cluster ions SiF3+(CO)(n), SiF3OH2+(SiF4)(n), SiF4H+(SiF4)(n), and F- (SiF4)(n),
J. Phys. Chem. A, 2000, 104, 36, 8353-8359, https://doi.org/10.1021/jp000525d
. [all data]