HCSiMeCl2 radical anion

Gas phase thermochemistry data

Data compiled by: John E. Bartmess

Quantity Value Units Method Reference Comment
Δfgas343. ± 21.kJ/molEIAEJaeger and Henglein, 1968From Me2SiCl2. G3MP2B3 calculations indicate an HOF(A-) 150 kcal/mol lower in energy.

References

Jaeger and Henglein, 1968
Jaeger, K.; Henglein, A., Die Bildung negativer Ionen aus SiCl4 und organischen Siliciumchloriden durch Elektronenstoss, Z. Naturfor., 1968, 23A, 1122. [all data]