PhSnH2 anion

Reaction thermochemistry data

Data compiled by: John E. Bartmess

Individual Reactions

C6H7Sn- + Hydrogen cation = C6H8Sn

By formula: C6H7Sn- + H+ = C6H8Sn

Quantity Value Units Method Reference Comment
Δr1400. ± 16.kJ/molIMREGal, Decouzon, et al., 2001gas phase

References

Gal, Decouzon, et al., 2001
Gal, J.F.; Decouzon, M.; Maria, P.C.; Gonzalez, A.I.; Mo, O.; Yanez, M.; El Chaouch, S.; Guillemin, J.C., Acidity trends in alpha,beta-unsaturated alkanes, silanes, germanes, and stannanes, J. Am. Chem. Soc., 2001, 123, 26, 6353-6359, https://doi.org/10.1021/ja004079j . [all data]