F3 anion

Ion clustering data

Data compiled by: John E. Bartmess

Clustering reactions

Fluorine anion + fluorine = F3-

By formula: F- + F2 = F3-

Quantity Value Units Method Reference Comment
Δr97. ± 10.kJ/molCIDTArtau, Nizzi, et al., 2000gas phase

References

Artau, Nizzi, et al., 2000
Artau, A.; Nizzi, K.E.; Hill, B.T.; Sunderlin, L.S.; Wenthold, P.G., Bond dissociation energy in trifluoride ion, J. Am. Chem. Soc., 2000, 122, 43, 10667-10670, https://doi.org/10.1021/ja001613e . [all data]