naphthalen-3-yl-2-ide anion

Reaction thermochemistry data

Data compiled by: John E. Bartmess

Individual Reactions

C10H6- + Hydrogen cation = Naphth-2-yl

By formula: C10H6- + H+ = C10H7

Quantity Value Units Method Reference Comment
Δr1577. ± 13.kJ/molG+TSReed, Hare, et al., 2000gas phase; Between tBuOD and 1-pentyne
Quantity Value Units Method Reference Comment
Δr1545. ± 13.kJ/molIMRBReed, Hare, et al., 2000gas phase; Between tBuOD and 1-pentyne

References

Reed, Hare, et al., 2000
Reed, D.R.; Hare, M.; Kass, S.R., Formation of gas-phase dianions and distonic ions as a general method for the synthesis of protected reactive intermediates. Energetics of 2,3-and 2,6-dehydronaphthalene, J. Am. Chem. Soc., 2000, 122, 43, 10689-10696, https://doi.org/10.1021/ja002351j . [all data]