benzene..Sc anion

Gas phase ion energetics data

Data compiled by: John E. Bartmess

Electron affinity of neutral species

EAneutral (eV) Method Reference Comment
0.49 ± 0.10LPESJudai, Nakamura, et al., 2001

References

Judai, Nakamura, et al., 2001
Judai, K.; Nakamura, Y.; Tachibana, M.; Negishi, Y.; Nakajima, A.; Kaya, K., Photoelectron spectroscopy of scandium-arene complex anions, Chem. Lett., 2001, 30, 2, 114-115, https://doi.org/10.1246/cl.2001.114 . [all data]