pMe-C6H4S(O)(=NSO2CF3)NH anion
- Formula: C8H8F3N2O3S2-
- Molecular weight: 301.286

Reaction thermochemistry data

Data compiled by: John E. Bartmess
Individual Reactions
C8H8F3N2O3S2- + = C8H9F3N2O3S2
By formula: C8H8F3N2O3S2- + H+ = C8H9F3N2O3S2
Quantity | Value | Units | Method | Reference | Comment |
---|---|---|---|---|---|
ΔrG° | 1299. ± 8.4 | kJ/mol | IMRE | Koppel, Koppel, et al., 2001 | gas phase |

Gas phase ion energetics data

Data compiled by: John E. Bartmess
Protonation reactions
C8H8F3N2O3S2- + = C8H9F3N2O3S2
By formula: C8H8F3N2O3S2- + H+ = C8H9F3N2O3S2
Quantity | Value | Units | Method | Reference | Comment |
---|---|---|---|---|---|
ΔrG° | 1299. ± 8.4 | kJ/mol | IMRE | Koppel, Koppel, et al., 2001 | gas phase |

References

Koppel, Koppel, et al., 2001
Koppel, I.A.; Koppel, J.; Leito, I.; Koppel, I.; Mishima, M.; Yagupolskii, L.M.,
The enormous acidifying effect of the supersubstituent =NSO2CF3 on the acidity of derivatives of benzenesulfonamide and toluene-p-sulfonamide in the gas phase and in dimethyl sulfoxide,
J. Chem. Soc. Perkin Trans., 2001, 2, 2, 229-232, https://doi.org/10.1039/b005765g
. [all data]