Decafluorocyclohexene anion

Gas phase thermochemistry data

Data compiled by: John E. Bartmess

Quantity Value Units Method Reference Comment
Δfgas<-2504. ± 30.kJ/molR-EALifshitz, Tiernan, et al., 1973

References

Lifshitz, Tiernan, et al., 1973
Lifshitz, C.; Tiernan, T.O.; Hughes, B.M., Electron affinities from endothermic negative-ion charge transfer reactions. IV. SF6, selected fluorocarbons, and other polyatomic molecules, J. Chem. Phys., 1973, 59, 3182. [all data]