Potassium heptamer, positive ion
- Formula: K7+
- Molecular weight: 273.6876

Ion clustering data

Data compiled by: Michael M. Meot-Ner (Mautner) and Sharon G. Lias
Clustering reactions
By formula: K7+ + K2 = (K7+ • K2)
Quantity | Value | Units | Method | Reference | Comment |
---|---|---|---|---|---|
ΔrH° | 90.8 | kJ/mol | PDiss | Brechignac, Cahuzac, et al., 1990 | gas phase |

Reaction thermochemistry data

Data compiled by: Michael M. Meot-Ner (Mautner) and Sharon G. Lias

Individual Reactions

K7+ + Dipotassium = (K7+ • Dipotassium)

By formula: K7+ + K2 = (K7+ • K2)

Quantity Value Units Method Reference Comment
Δr21.7kcal/molPDissBrechignac, Cahuzac, et al., 1990gas phase

References

Brechignac, Cahuzac, et al., 1990
Brechignac, C.; Cahuzac, P.; Carlier, F.; De Frutos, M.; Leyniger, J.,
Cohesive Energies of (K)n+ 5<n<200 from Photoevaporation Experiments,
J. Chem. Phys., 1990, 93, 10, 7449, https://doi.org/10.1063/1.459418
. [all data]