SiF4..nitrobenzene radical anion
- Formula: C6H5F4NO2Si-
- Molecular weight: 227.1891

Gas phase thermochemistry data

Data compiled by: John E. Bartmess
Quantity | Value | Units | Method | Reference | Comment |
---|---|---|---|---|---|
ΔfH°gas | -1791. ± 13. | kJ/mol | Ther | Williamson, Knighton, et al., 2001 | at 150 C |

Ion clustering data

Data compiled by: John E. Bartmess
Clustering reactions
C6H5NO2- + = C6H5F4NO2Si-
By formula: C6H5NO2- + F4Si = C6H5F4NO2Si-
Quantity | Value | Units | Method | Reference | Comment |
---|---|---|---|---|---|
ΔrH° | 146. ± 8.4 | kJ/mol | TDAs | Williamson, Knighton, et al., 2001 | gas phase; at 150 C |
Quantity | Value | Units | Method | Reference | Comment |
ΔrG° | 64.9 ± 2.5 | kJ/mol | TDAs | Williamson, Knighton, et al., 2001 | gas phase; at 150 C |

References

Williamson, Knighton, et al., 2001
Williamson, D.H.; Knighton, W.B.; Grimsrud, E.P.,
Lewis acid-base interactions of SiF4 with molecular anions formed by electron capture reactions,
Int. J. Mass Spectrom., 2001, 206, 1-2, 53-61, https://doi.org/10.1016/S1387-3806(00)00388-2
. [all data]