Sulfuric acid, negative ion
- Formula: H2O4S-
- Molecular weight: 98.079

Reaction thermochemistry data

Data compiled by: Michael M. Meot-Ner (Mautner) and Sharon G. Lias
Individual Reactions
(H2O4S- • ) + HO3S = (H2O4S- • HO3S • )
By formula: (H2O4S- • H2O4S) + HO3S = (H2O4S- • HO3S • H2O4S)
Quantity | Value | Units | Method | Reference | Comment |
---|---|---|---|---|---|
ΔrH° | 92.5 | kJ/mol | ATM | Arnold and Qiu, 1984 | gas phase; Entropy change calculated or estimated |
Quantity | Value | Units | Method | Reference | Comment |
ΔrS° | 100. | J/mol*K | N/A | Arnold and Qiu, 1984 | gas phase; Entropy change calculated or estimated |
Free energy of reaction
ΔrG° (kJ/mol) | T (K) | Method | Reference | Comment |
---|---|---|---|---|
66.5 | 250. | ATM | Arnold and Qiu, 1984 | gas phase; Entropy change calculated or estimated |

Ion clustering data

Data compiled by: Michael M. Meot-Ner (Mautner) and Sharon G. Lias
Clustering reactions
(H2O4S- • ) + HO3S = (H2O4S- • HO3S •
)
By formula: (H2O4S- • H2O4S) + HO3S = (H2O4S- • HO3S • H2O4S)
Quantity | Value | Units | Method | Reference | Comment |
---|---|---|---|---|---|
ΔrH° | 22.1 | kcal/mol | ATM | Arnold and Qiu, 1984 | gas phase; Entropy change calculated or estimated |
Quantity | Value | Units | Method | Reference | Comment |
ΔrS° | 25. | cal/mol*K | N/A | Arnold and Qiu, 1984 | gas phase; Entropy change calculated or estimated |
Free energy of reaction
ΔrG° (kcal/mol) | T (K) | Method | Reference | Comment |
---|---|---|---|---|
15.9 | 250. | ATM | Arnold and Qiu, 1984 | gas phase; Entropy change calculated or estimated |

References

Arnold and Qiu, 1984
Arnold, F.; Qiu, S.,
Upper Stratosphere Negative Ion Composition Measurements and Infrared Trace Gas Abundances,
Planet. Space Sci., 1984, 32, 2, 169, https://doi.org/10.1016/0032-0633(84)90151-X
. [all data]