Si(CH3)2
- Formula: C2H6Si
- Molecular weight: 58.1545

Reaction thermochemistry data

Data compiled by: Michael M. Meot-Ner (Mautner) and Sharon G. Lias
Individual Reactions
By formula: Fe+ + C2H6Si = (Fe+ • C2H6Si)
Quantity | Value | Units | Method | Reference | Comment |
---|---|---|---|---|---|
ΔrH° | 68.5 ± 8.5 | kcal/mol | ICR | Jacobson and Bakhtiar, 1993 | gas phase |

Ion clustering data

Data compiled by: Michael M. Meot-Ner (Mautner) and Sharon G. Lias
Clustering reactions
By formula: Fe+ + C2H6Si = (Fe+ • C2H6Si)
Quantity | Value | Units | Method | Reference | Comment |
---|---|---|---|---|---|
ΔrH° | 68.5 ± 8.5 | kcal/mol | ICR | Jacobson and Bakhtiar, 1993 | gas phase |

References

Jacobson and Bakhtiar, 1993
Jacobson, D.B.; Bakhtiar, R.,
Generation, Characterization and Properties of Iron-Silylene and Iron-Sylene Cationic Complexes in the Gas Phase,
J. Am. Chem. Soc., 1993, 115, 23, 10830, https://doi.org/10.1021/ja00076a046
. [all data]