1,9-Diaminononane, diprotonated
- Formula: C9H24N2+2
- Molecular weight: 160.2992

Reaction thermochemistry data

Data compiled by: Michael M. Meot-Ner (Mautner) and Sharon G. Lias
Individual Reactions
(C9H24N2+2 • ) +
= (C9H24N2+2 • 2
)
By formula: (C9H24N2+2 • H2O) + H2O = (C9H24N2+2 • 2H2O)
Bond type: Hydrogen bond (positive ion to hydride)
Quantity | Value | Units | Method | Reference | Comment |
---|---|---|---|---|---|
ΔrH° | 68.2 | kJ/mol | ES/HPMS | Blades, Klassen, et al., 1996 | gas phase |
Quantity | Value | Units | Method | Reference | Comment |
ΔrS° | 97.9 | J/mol*K | ES/HPMS | Blades, Klassen, et al., 1996 | gas phase |
Quantity | Value | Units | Method | Reference | Comment |
ΔrG° | 39. | kJ/mol | ES/HPMS | Blades, Klassen, et al., 1996 | gas phase |
By formula: C9H24N2+2 + H2O = (C9H24N2+2 • H2O)
Bond type: Hydrogen bond (positive ion to hydride)
Quantity | Value | Units | Method | Reference | Comment |
---|---|---|---|---|---|
ΔrH° | 69.0 | kJ/mol | ES/HPMS | Blades, Klassen, et al., 1996 | gas phase |
Quantity | Value | Units | Method | Reference | Comment |
ΔrS° | 87.0 | J/mol*K | ES/HPMS | Blades, Klassen, et al., 1996 | gas phase |
Quantity | Value | Units | Method | Reference | Comment |
ΔrG° | 43.1 | kJ/mol | ES/HPMS | Blades, Klassen, et al., 1996 | gas phase |

Ion clustering data

Data compiled by: Michael M. Meot-Ner (Mautner) and Sharon G. Lias
Clustering reactions
By formula: C9H24N2+2 + H2O = (C9H24N2+2 • H2O)
Bond type: Hydrogen bond (positive ion to hydride)
Quantity | Value | Units | Method | Reference | Comment |
---|---|---|---|---|---|
ΔrH° | 69.0 | kJ/mol | ES/HPMS | Blades, Klassen, et al., 1996 | gas phase |
Quantity | Value | Units | Method | Reference | Comment |
ΔrS° | 87.0 | J/mol*K | ES/HPMS | Blades, Klassen, et al., 1996 | gas phase |
Quantity | Value | Units | Method | Reference | Comment |
ΔrG° | 43.1 | kJ/mol | ES/HPMS | Blades, Klassen, et al., 1996 | gas phase |
(C9H24N2+2 • ) +
= (C9H24N2+2 • 2
)
By formula: (C9H24N2+2 • H2O) + H2O = (C9H24N2+2 • 2H2O)
Bond type: Hydrogen bond (positive ion to hydride)
Quantity | Value | Units | Method | Reference | Comment |
---|---|---|---|---|---|
ΔrH° | 68.2 | kJ/mol | ES/HPMS | Blades, Klassen, et al., 1996 | gas phase |
Quantity | Value | Units | Method | Reference | Comment |
ΔrS° | 97.9 | J/mol*K | ES/HPMS | Blades, Klassen, et al., 1996 | gas phase |
Quantity | Value | Units | Method | Reference | Comment |
ΔrG° | 39. | kJ/mol | ES/HPMS | Blades, Klassen, et al., 1996 | gas phase |

References

Blades, Klassen, et al., 1996
Blades, A.T.; Klassen, J.S.; Kebarle, P.,
Determination of Ion-Solvent Equilibria in the Gas Phase. Hydration of Diprotonated Diamines and Bis(trimethylammonium) Alkanes,
J. Am. Chem. Soc., 1996, 118, 49, 12437, https://doi.org/10.1021/ja962641t
. [all data]