Nonanedioic acid, diconjugate base
- Formula: C9H14O4-2
- Molecular weight: 186.2062

Reaction thermochemistry data

Data compiled by: Michael M. Meot-Ner (Mautner) and Sharon G. Lias
Individual Reactions
(C9H14O4-2 • 2) +
= (C9H14O4-2 • 3
)
By formula: (C9H14O4-2 • 2H2O) + H2O = (C9H14O4-2 • 3H2O)
Bond type: Hydrogen bond (negative ion to hydride)
Quantity | Value | Units | Method | Reference | Comment |
---|---|---|---|---|---|
ΔrG° | 32. | kJ/mol | ES/HPMS | Blades, Klassen, et al., 1995 | gas phase |
(C9H14O4-2 • 3) +
= (C9H14O4-2 • 4
)
By formula: (C9H14O4-2 • 3H2O) + H2O = (C9H14O4-2 • 4H2O)
Bond type: Hydrogen bond (negative ion to hydride)
Quantity | Value | Units | Method | Reference | Comment |
---|---|---|---|---|---|
ΔrG° | 29. | kJ/mol | ES/HPMS | Blades, Klassen, et al., 1995 | gas phase |
(C9H14O4-2 • 4) +
= (C9H14O4-2 • 5
)
By formula: (C9H14O4-2 • 4H2O) + H2O = (C9H14O4-2 • 5H2O)
Bond type: Hydrogen bond (negative ion to hydride)
Quantity | Value | Units | Method | Reference | Comment |
---|---|---|---|---|---|
ΔrG° | 25. | kJ/mol | ES/HPMS | Blades, Klassen, et al., 1995 | gas phase |
(C9H14O4-2 • 5) +
= (C9H14O4-2 • 6
)
By formula: (C9H14O4-2 • 5H2O) + H2O = (C9H14O4-2 • 6H2O)
Bond type: Hydrogen bond (negative ion to hydride)
Quantity | Value | Units | Method | Reference | Comment |
---|---|---|---|---|---|
ΔrG° | 22. | kJ/mol | ES/HPMS | Blades, Klassen, et al., 1995 | gas phase |
By formula: C9H14O4-2 + H2O = (C9H14O4-2 • H2O)
Bond type: Hydrogen bond (negative ion to hydride)
Quantity | Value | Units | Method | Reference | Comment |
---|---|---|---|---|---|
ΔrG° | 22. | kJ/mol | ES/HPMS | Blades, Klassen, et al., 1995 | gas phase |

Ion clustering data

Data compiled by: Michael M. Meot-Ner (Mautner) and Sharon G. Lias
Clustering reactions
By formula: C9H14O4-2 + H2O = (C9H14O4-2 • H2O)
Bond type: Hydrogen bond (negative ion to hydride)
Quantity | Value | Units | Method | Reference | Comment |
---|---|---|---|---|---|
ΔrG° | 22. | kJ/mol | ES/HPMS | Blades, Klassen, et al., 1995 | gas phase |
(C9H14O4-2 • 2) +
= (C9H14O4-2 • 3
)
By formula: (C9H14O4-2 • 2H2O) + H2O = (C9H14O4-2 • 3H2O)
Bond type: Hydrogen bond (negative ion to hydride)
Quantity | Value | Units | Method | Reference | Comment |
---|---|---|---|---|---|
ΔrG° | 32. | kJ/mol | ES/HPMS | Blades, Klassen, et al., 1995 | gas phase |
(C9H14O4-2 • 3) +
= (C9H14O4-2 • 4
)
By formula: (C9H14O4-2 • 3H2O) + H2O = (C9H14O4-2 • 4H2O)
Bond type: Hydrogen bond (negative ion to hydride)
Quantity | Value | Units | Method | Reference | Comment |
---|---|---|---|---|---|
ΔrG° | 29. | kJ/mol | ES/HPMS | Blades, Klassen, et al., 1995 | gas phase |
(C9H14O4-2 • 4) +
= (C9H14O4-2 • 5
)
By formula: (C9H14O4-2 • 4H2O) + H2O = (C9H14O4-2 • 5H2O)
Bond type: Hydrogen bond (negative ion to hydride)
Quantity | Value | Units | Method | Reference | Comment |
---|---|---|---|---|---|
ΔrG° | 25. | kJ/mol | ES/HPMS | Blades, Klassen, et al., 1995 | gas phase |
(C9H14O4-2 • 5) +
= (C9H14O4-2 • 6
)
By formula: (C9H14O4-2 • 5H2O) + H2O = (C9H14O4-2 • 6H2O)
Bond type: Hydrogen bond (negative ion to hydride)
Quantity | Value | Units | Method | Reference | Comment |
---|---|---|---|---|---|
ΔrG° | 22. | kJ/mol | ES/HPMS | Blades, Klassen, et al., 1995 | gas phase |

References

Blades, Klassen, et al., 1995
Blades, A.T.; Klassen, J.S.; Kebarle, P.,
Free Energies of Hydration in the Gas Phase on the Anions of Some Oxo Acids of C, N, S, P, Cl and I,
J. Am. Chem. Soc., 1995, 117, 42, 10563, https://doi.org/10.1021/ja00147a019
. [all data]