2-tert-Butylpyridine, protonated
- Formula: C9H14N+
- Molecular weight: 136.2136

Reaction thermochemistry data

Data compiled by: Michael M. Meot-Ner (Mautner) and Sharon G. Lias
Individual Reactions
By formula: C9H14N+ + H2O = (C9H14N+ • H2O)
Bond type: Hydrogen bond (positive ion to hydride)
Quantity | Value | Units | Method | Reference | Comment |
---|---|---|---|---|---|
ΔrH° | 59.4 | kJ/mol | PHPMS | Meot-Ner M. and Sieck, 1983 | gas phase |
Quantity | Value | Units | Method | Reference | Comment |
ΔrS° | 129. | J/mol*K | PHPMS | Meot-Ner M. and Sieck, 1983 | gas phase |
By formula: C9H14N+ + C9H13N = (C9H14N+ • C9H13N)
Quantity | Value | Units | Method | Reference | Comment |
---|---|---|---|---|---|
ΔrH° | 96.2 | kJ/mol | PHPMS | Meot-Ner M. and Sieck, 1983 | gas phase |
Quantity | Value | Units | Method | Reference | Comment |
ΔrS° | 165. | J/mol*K | PHPMS | Meot-Ner M. and Sieck, 1983 | gas phase |

Ion clustering data

Data compiled by: Michael M. Meot-Ner (Mautner) and Sharon G. Lias
Clustering reactions
By formula: C9H14N+ + C9H13N = (C9H14N+ • C9H13N)
Quantity | Value | Units | Method | Reference | Comment |
---|---|---|---|---|---|
ΔrH° | 96.2 | kJ/mol | PHPMS | Meot-Ner M. and Sieck, 1983 | gas phase |
Quantity | Value | Units | Method | Reference | Comment |
ΔrS° | 165. | J/mol*K | PHPMS | Meot-Ner M. and Sieck, 1983 | gas phase |
By formula: C9H14N+ + H2O = (C9H14N+ • H2O)
Bond type: Hydrogen bond (positive ion to hydride)
Quantity | Value | Units | Method | Reference | Comment |
---|---|---|---|---|---|
ΔrH° | 59.4 | kJ/mol | PHPMS | Meot-Ner M. and Sieck, 1983 | gas phase |
Quantity | Value | Units | Method | Reference | Comment |
ΔrS° | 129. | J/mol*K | PHPMS | Meot-Ner M. and Sieck, 1983 | gas phase |

References

Meot-Ner M. and Sieck, 1983
Meot-Ner M.; Sieck, L.W.,
The Ionic Hydrogen Bond. 1. Sterically Hindered Bonds. Solvation and Clustering of Sterically Hindered Amines and Pyridines,
J. Am. Chem. Soc., 1983, 105, 10, 2956, https://doi.org/10.1021/ja00348a005
. [all data]