Benzamide, N,N-dimethyl, protonated
- Formula: C9H12NO+
- Molecular weight: 150.1971

Ion clustering data

Data compiled by: Michael M. Meot-Ner (Mautner) and Sharon G. Lias
Clustering reactions
By formula: C9H12NO+ + H2O = (C9H12NO+ • H2O)
Bond type: Hydrogen bond (positive ion to hydride)
Quantity | Value | Units | Method | Reference | Comment |
---|---|---|---|---|---|
ΔrH° | 63.2 | kJ/mol | PHPMS | Meot-Ner, 1984 | gas phase |
Quantity | Value | Units | Method | Reference | Comment |
ΔrS° | 110. | J/mol*K | PHPMS | Meot-Ner, 1984 | gas phase |

Reaction thermochemistry data

Data compiled by: Michael M. Meot-Ner (Mautner) and Sharon G. Lias

Individual Reactions

C9H12NO+ + Water = (C9H12NO+ • Water)

By formula: C9H12NO+ + H2O = (C9H12NO+ • H2O)

Bond type: Hydrogen bond (positive ion to hydride)

Quantity Value Units Method Reference Comment
Δr63.2kJ/molPHPMSMeot-Ner, 1984gas phase
Quantity Value Units Method Reference Comment
Δr110.J/mol*KPHPMSMeot-Ner, 1984gas phase

References

Meot-Ner, 1984
Meot-Ner, (Mautner),
The Ionic Hydrogen Bond. 4. Intramolecular and Multiple Bonds. Proton Affinities, Hydration and Complexes of Amides and Amino Acid Derivatives,
J. Am. Chem. Soc., 1984, 106, 2, 278, https://doi.org/10.1021/ja00314a003
. [all data]