N-Glycyl lysine, protonated
- Formula: C8H18N3O3+
- Molecular weight: 204.2463

Ion clustering data

Data compiled by: Michael M. Meot-Ner (Mautner) and Sharon G. Lias
Clustering reactions
C8H18N3O3+ + = (C8H18N3O3+ •
)
By formula: C8H18N3O3+ + H2O = (C8H18N3O3+ • H2O)
Bond type: Hydrogen bond (positive ion to hydride)
Free energy of reaction
ΔrG° (kJ/mol) | T (K) | Method | Reference | Comment |
---|---|---|---|---|
21. | 293. | ES/HPMS | Klassen, Blades, et al., 1995 | gas phase |

References

Klassen, Blades, et al., 1995
Klassen, J.S.; Blades, A.T.; Kebarle, P.,
Determinations of Ion-Molecule Equilibria Involving Ions Produced by Electrospray. Hydration of Protonated Amines, Diamines, and Some Small Peptides,
J. Phys. Chem., 1995, 99, 42, 15509, https://doi.org/10.1021/j100042a027
. [all data]