1,8-Diaminooctane, diprotonated
- Formula: C8H22N2+2
- Molecular weight: 146.2726

Ion clustering data

Data compiled by: Michael M. Meot-Ner (Mautner) and Sharon G. Lias
Clustering reactions
By formula: C8H22N2+2 + H2O = (C8H22N2+2 • H2O)
Bond type: Hydrogen bond (positive ion to hydride)
Quantity | Value | Units | Method | Reference | Comment |
---|---|---|---|---|---|
ΔrH° | 70.7 | kJ/mol | ES/HPMS | Blades, Klassen, et al., 1996 | gas phase |
Quantity | Value | Units | Method | Reference | Comment |
ΔrS° | 90.0 | J/mol*K | ES/HPMS | Blades, Klassen, et al., 1996 | gas phase |
Quantity | Value | Units | Method | Reference | Comment |
ΔrG° | 43.9 | kJ/mol | ES/HPMS | Blades, Klassen, et al., 1996 | gas phase |
(C8H22N2+2 • ) +
= (C8H22N2+2 • 2
)
By formula: (C8H22N2+2 • H2O) + H2O = (C8H22N2+2 • 2H2O)
Bond type: Hydrogen bond (positive ion to hydride)
Quantity | Value | Units | Method | Reference | Comment |
---|---|---|---|---|---|
ΔrH° | 70.3 | kJ/mol | ES/HPMS | Blades, Klassen, et al., 1996 | gas phase |
Quantity | Value | Units | Method | Reference | Comment |
ΔrS° | 99.6 | J/mol*K | ES/HPMS | Blades, Klassen, et al., 1996 | gas phase |
Quantity | Value | Units | Method | Reference | Comment |
ΔrG° | 41. | kJ/mol | ES/HPMS | Blades, Klassen, et al., 1996 | gas phase |
(C8H22N2+2 • 2) +
= (C8H22N2+2 • 3
)
By formula: (C8H22N2+2 • 2H2O) + H2O = (C8H22N2+2 • 3H2O)
Bond type: Hydrogen bond (positive ion to hydride)
Free energy of reaction
ΔrG° (kJ/mol) | T (K) | Method | Reference | Comment |
---|---|---|---|---|
32. | 293. | ES/HPMS | Klassen, Blades, et al., 1995 | gas phase |
(C8H22N2+2 • 3) +
= (C8H22N2+2 • 4
)
By formula: (C8H22N2+2 • 3H2O) + H2O = (C8H22N2+2 • 4H2O)
Bond type: Hydrogen bond (positive ion to hydride)
Free energy of reaction
ΔrG° (kJ/mol) | T (K) | Method | Reference | Comment |
---|---|---|---|---|
29. | 293. | ES/HPMS | Klassen, Blades, et al., 1995 | gas phase |
(C8H22N2+2 • 4) +
= (C8H22N2+2 • 5
)
By formula: (C8H22N2+2 • 4H2O) + H2O = (C8H22N2+2 • 5H2O)
Bond type: Hydrogen bond (positive ion to hydride)
Free energy of reaction
ΔrG° (kJ/mol) | T (K) | Method | Reference | Comment |
---|---|---|---|---|
24. | 293. | ES/HPMS | Klassen, Blades, et al., 1995 | gas phase |
(C8H22N2+2 • 5) +
= (C8H22N2+2 • 6
)
By formula: (C8H22N2+2 • 5H2O) + H2O = (C8H22N2+2 • 6H2O)
Bond type: Hydrogen bond (positive ion to hydride)
Free energy of reaction
ΔrG° (kJ/mol) | T (K) | Method | Reference | Comment |
---|---|---|---|---|
22. | 293. | ES/HPMS | Klassen, Blades, et al., 1995 | gas phase |

Reaction thermochemistry data

Data compiled by: Michael M. Meot-Ner (Mautner) and Sharon G. Lias
Individual Reactions
(C8H22N2+2 • ) +
= (C8H22N2+2 • 2
)
By formula: (C8H22N2+2 • H2O) + H2O = (C8H22N2+2 • 2H2O)
Bond type: Hydrogen bond (positive ion to hydride)
Quantity | Value | Units | Method | Reference | Comment |
---|---|---|---|---|---|
ΔrH° | 16.8 | kcal/mol | ES/HPMS | Blades, Klassen, et al., 1996 | gas phase |
Quantity | Value | Units | Method | Reference | Comment |
ΔrS° | 23.8 | cal/mol*K | ES/HPMS | Blades, Klassen, et al., 1996 | gas phase |
Quantity | Value | Units | Method | Reference | Comment |
ΔrG° | 9.7 | kcal/mol | ES/HPMS | Blades, Klassen, et al., 1996 | gas phase |
By formula: C8H22N2+2 + H2O = (C8H22N2+2 • H2O)
Bond type: Hydrogen bond (positive ion to hydride)
Quantity | Value | Units | Method | Reference | Comment |
---|---|---|---|---|---|
ΔrH° | 16.9 | kcal/mol | ES/HPMS | Blades, Klassen, et al., 1996 | gas phase |
Quantity | Value | Units | Method | Reference | Comment |
ΔrS° | 21.5 | cal/mol*K | ES/HPMS | Blades, Klassen, et al., 1996 | gas phase |
Quantity | Value | Units | Method | Reference | Comment |
ΔrG° | 10.5 | kcal/mol | ES/HPMS | Blades, Klassen, et al., 1996 | gas phase |
(C8H22N2+2 • 2) +
= (C8H22N2+2 • 3
)
By formula: (C8H22N2+2 • 2H2O) + H2O = (C8H22N2+2 • 3H2O)
Bond type: Hydrogen bond (positive ion to hydride)
Free energy of reaction
ΔrG° (kcal/mol) | T (K) | Method | Reference | Comment |
---|---|---|---|---|
7.7 | 293. | ES/HPMS | Klassen, Blades, et al., 1995 | gas phase |
(C8H22N2+2 • 3) +
= (C8H22N2+2 • 4
)
By formula: (C8H22N2+2 • 3H2O) + H2O = (C8H22N2+2 • 4H2O)
Bond type: Hydrogen bond (positive ion to hydride)
Free energy of reaction
ΔrG° (kcal/mol) | T (K) | Method | Reference | Comment |
---|---|---|---|---|
6.9 | 293. | ES/HPMS | Klassen, Blades, et al., 1995 | gas phase |
(C8H22N2+2 • 4) +
= (C8H22N2+2 • 5
)
By formula: (C8H22N2+2 • 4H2O) + H2O = (C8H22N2+2 • 5H2O)
Bond type: Hydrogen bond (positive ion to hydride)
Free energy of reaction
ΔrG° (kcal/mol) | T (K) | Method | Reference | Comment |
---|---|---|---|---|
5.8 | 293. | ES/HPMS | Klassen, Blades, et al., 1995 | gas phase |
(C8H22N2+2 • 5) +
= (C8H22N2+2 • 6
)
By formula: (C8H22N2+2 • 5H2O) + H2O = (C8H22N2+2 • 6H2O)
Bond type: Hydrogen bond (positive ion to hydride)
Free energy of reaction
ΔrG° (kcal/mol) | T (K) | Method | Reference | Comment |
---|---|---|---|---|
5.2 | 293. | ES/HPMS | Klassen, Blades, et al., 1995 | gas phase |

References

Blades, Klassen, et al., 1996
Blades, A.T.; Klassen, J.S.; Kebarle, P.,
Determination of Ion-Solvent Equilibria in the Gas Phase. Hydration of Diprotonated Diamines and Bis(trimethylammonium) Alkanes,
J. Am. Chem. Soc., 1996, 118, 49, 12437, https://doi.org/10.1021/ja962641t
. [all data]
Klassen, Blades, et al., 1995
Klassen, J.S.; Blades, A.T.; Kebarle, P.,
Determinations of Ion-Molecule Equilibria Involving Ions Produced by Electrospray. Hydration of Protonated Amines, Diamines, and Some Small Peptides,
J. Phys. Chem., 1995, 99, 42, 15509, https://doi.org/10.1021/j100042a027
. [all data]