1-Octanamine, protonated
- Formula: C8H20N+
- Molecular weight: 130.2506

Reaction thermochemistry data

Data compiled by: Michael M. Meot-Ner (Mautner) and Sharon G. Lias
Individual Reactions
(C8H20N+ • 2) +
= (C8H20N+ • 3
)
By formula: (C8H20N+ • 2H2O) + H2O = (C8H20N+ • 3H2O)
Bond type: Hydrogen bond (positive ion to hydride)
Free energy of reaction
ΔrG° (kJ/mol) | T (K) | Method | Reference | Comment |
---|---|---|---|---|
19. | 293. | ES/HPMS | Blades, Klassen, et al., 1995 | gas phase |
(C8H20N+ • ) +
= (C8H20N+ • 2
)
By formula: (C8H20N+ • H2O) + H2O = (C8H20N+ • 2H2O)
Bond type: Hydrogen bond (positive ion to hydride)
Free energy of reaction
ΔrG° (kJ/mol) | T (K) | Method | Reference | Comment |
---|---|---|---|---|
26. | 293. | ES/HPMS | Blades, Klassen, et al., 1995 | gas phase |
By formula: C8H20N+ + H2O = (C8H20N+ • H2O)
Bond type: Hydrogen bond (positive ion to hydride)
Free energy of reaction
ΔrG° (kJ/mol) | T (K) | Method | Reference | Comment |
---|---|---|---|---|
36. | 293. | ES/HPMS | Blades, Klassen, et al., 1995 | gas phase |

Ion clustering data

Data compiled by: Michael M. Meot-Ner (Mautner) and Sharon G. Lias
Clustering reactions
By formula: C8H20N+ + H2O = (C8H20N+ • H2O)
Bond type: Hydrogen bond (positive ion to hydride)
Free energy of reaction
ΔrG° (kJ/mol) | T (K) | Method | Reference | Comment |
---|---|---|---|---|
36. | 293. | ES/HPMS | Blades, Klassen, et al., 1995 | gas phase |
(C8H20N+ • ) +
= (C8H20N+ • 2
)
By formula: (C8H20N+ • H2O) + H2O = (C8H20N+ • 2H2O)
Bond type: Hydrogen bond (positive ion to hydride)
Free energy of reaction
ΔrG° (kJ/mol) | T (K) | Method | Reference | Comment |
---|---|---|---|---|
26. | 293. | ES/HPMS | Blades, Klassen, et al., 1995 | gas phase |
(C8H20N+ • 2) +
= (C8H20N+ • 3
)
By formula: (C8H20N+ • 2H2O) + H2O = (C8H20N+ • 3H2O)
Bond type: Hydrogen bond (positive ion to hydride)
Free energy of reaction
ΔrG° (kJ/mol) | T (K) | Method | Reference | Comment |
---|---|---|---|---|
19. | 293. | ES/HPMS | Blades, Klassen, et al., 1995 | gas phase |

References

Blades, Klassen, et al., 1995
Blades, A.T.; Klassen, J.S.; Kebarle, P.,
Free Energies of Hydration in the Gas Phase on the Anions of Some Oxo Acids of C, N, S, P, Cl and I,
J. Am. Chem. Soc., 1995, 117, 42, 10563, https://doi.org/10.1021/ja00147a019
. [all data]