Phenol, 3-methyl-, protonated
- Formula: C7H9O+
- Molecular weight: 109.1452

Reaction thermochemistry data

Data compiled by: Michael M. Meot-Ner (Mautner) and Sharon G. Lias
Individual Reactions
By formula: C7H9O+ + H2O = (C7H9O+ • H2O)
Bond type: Hydrogen bond (positive ion to hydride)
Free energy of reaction
ΔrG° (kcal/mol) | T (K) | Method | Reference | Comment |
---|---|---|---|---|
4.2 | 454. | PHPMS | Martinsen and Buttrill, 1978 | gas phase |

Ion clustering data

Data compiled by: Michael M. Meot-Ner (Mautner) and Sharon G. Lias
Clustering reactions
By formula: C7H9O+ + H2O = (C7H9O+ • H2O)
Bond type: Hydrogen bond (positive ion to hydride)
Free energy of reaction
ΔrG° (kcal/mol) | T (K) | Method | Reference | Comment |
---|---|---|---|---|
4.2 | 454. | PHPMS | Martinsen and Buttrill, 1978 | gas phase |

References

Martinsen and Buttrill, 1978
Martinsen, D.P.; Buttrill, S.E.,
Hydrogen Bonding of Water to Gas - Phase Ions. Structural and Stereochemical Effects in Protonated Phenols,
J. Am. Chem. Soc., 1978, 100, 21, 6559, https://doi.org/10.1021/ja00489a002
. [all data]