Hexanedioic acid, conjugate base
- Formula: C6H9O4-
- Molecular weight: 145.1338

Ion clustering data

Data compiled by: Michael M. Meot-Ner (Mautner) and Sharon G. Lias
Clustering reactions
By formula: C6H9O4- + H2O = (C6H9O4- • H2O)
Bond type: Hydrogen bond (negative ion to hydride)
Quantity | Value | Units | Method | Reference | Comment |
---|---|---|---|---|---|
ΔrG° | 24. | kJ/mol | ES/HPMS | Blades, Klassen, et al., 1995 | gas phase |
(C6H9O4- • ) +
= (C6H9O4- • 2
)
By formula: (C6H9O4- • H2O) + H2O = (C6H9O4- • 2H2O)
Bond type: Hydrogen bond (negative ion to hydride)
Quantity | Value | Units | Method | Reference | Comment |
---|---|---|---|---|---|
ΔrG° | 18. | kJ/mol | ES/HPMS | Blades, Klassen, et al., 1995 | gas phase |

Reaction thermochemistry data

Data compiled by: Michael M. Meot-Ner (Mautner) and Sharon G. Lias
Individual Reactions
(C6H9O4- • ) +
= (C6H9O4- • 2
)
By formula: (C6H9O4- • H2O) + H2O = (C6H9O4- • 2H2O)
Bond type: Hydrogen bond (negative ion to hydride)
Quantity | Value | Units | Method | Reference | Comment |
---|---|---|---|---|---|
ΔrG° | 4.4 | kcal/mol | ES/HPMS | Blades, Klassen, et al., 1995 | gas phase |
By formula: C6H9O4- + H2O = (C6H9O4- • H2O)
Bond type: Hydrogen bond (negative ion to hydride)
Quantity | Value | Units | Method | Reference | Comment |
---|---|---|---|---|---|
ΔrG° | 5.7 | kcal/mol | ES/HPMS | Blades, Klassen, et al., 1995 | gas phase |

References

Blades, Klassen, et al., 1995
Blades, A.T.; Klassen, J.S.; Kebarle, P.,
Free Energies of Hydration in the Gas Phase on the Anions of Some Oxo Acids of C, N, S, P, Cl and I,
J. Am. Chem. Soc., 1995, 117, 42, 10563, https://doi.org/10.1021/ja00147a019
. [all data]